program: Gaussian 09
title: 000068740
version: EM64L-G09RevD.01
frameworkgroup: C1[X(C5H10N2O7P2)]
method: RPBEPBE
basis: SDD
operation: Freq
keyword: #p
keyword: freq=noraman
keyword: PBEPBE/SDD
title: #p freq=noraman PBEPBE/SDD
converged: YES YES NO NO
title: Mulliken charges:
elementType: P P O O O O O O O N N C C C C C H H H H H H H H H H
charge: 1.299562 1.315390 -0.403700 -0.640939 -0.695859 -0.740381 -0.660211 -0.548815 -0.557393 -0.121346 -0.094815 -0.570035 -0.312257 -0.146469 -0.186049 -0.315133 0.278034 0.276761 0.414788 0.273144 0.256899 0.401511 0.410915 0.414330 0.401355 0.250714
chargesum: 0.00000
title: Mulliken charges with hydrogens summed into heavy atoms:
elementType: P P O O O O O O O N N C C C C C
charge: 1.299562 1.315390 0.011087 -0.239428 -0.284944 -0.326052 -0.258857 -0.548815 -0.557393 -0.121346 -0.094815 -0.570035 0.242538 0.126675 0.070850 -0.064419
polarizability: 1.72462400e+02 -6.50077669e+00 1.09508261e+02 5.56771940e+00 2.37793603e+00 1.22331266e+02
1716.lowfreq: -14.8401 -0.0003 0.0021 0.0021 4.2164 9.5387 10.7995 29.8290 48.8324
frequency: -10.6169 29.7510 48.8288 54.6156 86.9737 101.4917 113.3730 137.7560 141.5290 173.4089 197.5721 210.4003 235.7398 250.1834 262.4924 273.0210 283.5413 298.7608 316.6313 322.9376 348.2414 356.6714 373.7004 389.3031 416.2340 438.2538 549.5263 580.1716 620.9521 634.8293 649.9046 676.2555 690.7642 714.2222 729.1090 734.1824 769.0175 823.8117 849.6659 871.7697 875.9757 966.4890 995.4914 1000.8902 1002.1854 1007.0048 1016.1871 1052.1156 1066.9702 1076.8459 1091.2178 1108.1821 1208.2860 1225.1974 1263.2920 1314.5840 1350.8681 1365.8487 1386.9205 1432.8603 1458.7236 1481.3865 3005.8616 3102.2677 3228.1182 3231.7538 3266.7433 3364.6917 3583.6792 3590.4150 3618.5463 3631.5777
redmass: 6.1744 5.7450 4.2859 7.9283 4.8742 7.2631 4.5847 3.8742 4.4351 5.6083 6.0631 3.7698 3.7976 2.9624 2.1871 3.6195 4.7525 2.0647 2.2571 2.1832 2.2419 2.4779 2.6146 6.8862 4.4434 7.4507 1.2478 3.2377 3.4532 10.7182 3.2898 6.8780 7.4521 7.8170 2.5830 1.9982 1.3873 4.5891 1.4474 3.5870 5.9907 1.3499 1.4731 1.9605 1.6098 1.8745 2.2471 1.7437 4.5395 4.6284 3.4445 1.7437 1.5013 1.7089 1.8987 1.6026 4.7166 1.4480 1.6063 1.3486 1.8934 4.0826 1.0672 1.0956 1.0960 1.0947 1.1076 1.0647 1.0661 1.0662 1.0665 1.0668
irintensity: 3.2225 4.2585 1.4030 0.9418 3.6686 7.0391 12.5587 12.2322 36.8657 4.9356 5.1032 2.2975 24.6207 25.4616 23.6258 24.1978 53.9824 69.9575 174.7985 34.3095 7.4016 41.5003 79.2365 57.3372 35.1620 51.0543 112.7658 43.6427 58.4085 125.2550 18.7818 38.5692 71.2046 72.6710 204.3675 194.6477 92.5115 15.9634 3.9730 32.8605 16.2332 22.3984 26.4844 54.8276 6.6615 68.3296 32.9221 19.1084 22.3328 148.1817 164.9470 24.6276 50.0819 15.3690 51.4204 44.0446 9.8442 40.4851 10.4075 19.0676 61.4531 8.1493 11.9229 0.4736 3.0660 3.5212 2.0570 129.8724 86.6570 82.1614 79.6379 87.8671
temp: 298.150 k
press: 1.00000 atm
elementType: 15 15 8 8 8 8 8 8 8 7 7 6 6 6 6 6 1 1 1 1 1 1 1 1 1 1
symmnumber: 1
zpe: 449357.9 jmol-1
zpe.correction: 0.171151 hartree
zpe.thermalcorrener: 0.189409 hartree
zpe.thermalcorrenthalpy: 0.190353 hartree
zpe.thermalcorrgfe: 0.124911 hartree
zpe.sumelectzpe: -1513.760311 hartree
zpe.sumelectthermal: -1513.742053 hartree
zpe.sumelectthermalent: -1513.741109 hartree
zpe.sumelectthermalfe: -1513.806551 hartree
dipole: 5.7682 -2.4702 -0.2314
dipole: 6.2791
quadrupole: -134.2492 -100.9344 -93.5672
quadrupole: -5.7370 6.5550 4.6647
quadrupole: -24.6656 8.6492 16.0164 -5.7370 6.5550 4.6647
hfenergy: -1513.9314619 hartree
pointgroup: C01 [X(C5H10N2O7P2)]
dipole: -2.2620186 -0.9814627 -0.1513798 debye
dipolederiv: 1.5369639 -0.2062718 -0.0892572 -0.0103247 1.7020165 0.2105233 -0.0460358 0.0139872 1.5813664 1.5590524 0.3399706 -0.0245428 0.3285915 1.5991825 0.0367636 0.0479107 0.0051979 1.5901419 -0.639828 0.0076043 0.0205371 0.124504 -0.4508399 0.180216 -0.0134307 0.1744667 -0.7843721 -0.640498 0.1971364 0.3557442 0.1689706 -0.8218875 -0.1793788 0.320528 -0.1873424 -0.6816692 -0.6736974 0.0577394 -0.1483923 0.0277662 -0.5741642 0.1453127 -0.1124543 0.2858362 -0.9235184 -0.6812811 -0.1856048 0.0545664 -0.2603289 -1.123729 0.1947016 0.1405575 0.2066133 -0.7230915 -0.6305341 -0.168255 -0.0323149 -0.1924337 -0.5507848 -0.2702881 -0.1242947 -0.229229 -1.0690866 -0.6262296 0.0433549 0.0141065 -0.0588328 -0.7061036 -0.0763274 -0.0158129 -0.0486639 -0.5086817 -0.8543286 0.0641723 -0.0181729 -0.0837144 -0.5792767 -0.0373128 -0.0872073 0.0004555 -0.5407817 -1.08644 -0.0132312 -0.0168975 0.0333823 -0.112114 -0.0406416 -0.0176845 -0.0454424 -0.0857453 -0.7073313 0.0126987 0.0175053 -0.0603864 -0.245417 -0.0017396 -0.1218411 0.0112549 -0.2475855 0.1350282 -0.2159469 -0.0053596 0.0336177 0.1373072 -0.1150704 0.1664846 -0.3154713 0.3500386 0.6201399 -0.0744662 0.024993 -0.0782131 0.0470356 -0.0486816 -0.0617355 0.0818746 0.0211758 0.2758797 -0.0008505 0.0198975 -0.1077569 -0.1569182 0.0325809 0.3628872 -0.0282353 -0.0746172 0.6713579 0.0699958 -0.088924 0.3101132 -0.0628421 -0.1065442 -0.3347272 -0.0278745 0.0503643 -0.0065501 0.0270169 0.1527926 0.0045953 -0.1280208 -0.0581913 0.1959692 -0.1052233 0.1052154 -0.0369932 0.0197836 0.0182384 -0.0874947 -0.0570525 -0.0042432 0.0334891 0.0154783 0.08633 0.0742586 -0.0134245 0.0173781 0.027771 0.107928 0.0567098 -0.0264139 0.0385045 0.0112385 0.4925837 0.0412855 0.0073729 -0.0395395 0.2606262 -0.0446442 0.0068966 -0.0521515 0.3623192 0.1092067 -0.0639458 0.0702359 -0.050457 0.1885138 0.0435877 0.0254105 0.052499 0.0663217 0.0634766 0.0010744 -0.0845961 -0.015179 0.1684799 0.0567368 -0.0660691 0.0540593 0.031571 0.236361 -0.0310953 -0.0899099 -0.0410558 0.370484 0.000756 -0.120218 0.0016863 0.2616323 0.3635452 -0.0173761 -0.023199 -0.0316787 0.1725705 -0.0446674 -0.0080922 -0.0207128 0.3568318 0.1901474 -0.009991 -0.0650767 -0.0337316 0.3650805 0.0095306 -0.0492086 0.0328053 0.3731164 0.2428598 0.1097972 0.0130112 0.1066148 0.2762906 0.0307568 -0.0187118 0.0444993 0.3502529 0.0128505 0.0088293 -0.0997365 -0.0147994 0.1736352 0.0295547 -0.0761957 0.0411282 0.041233 unknown
polarizability: 172.1669393|5.5964614|111.0980605|7.6741216|-4.6641602|121.0369271 unknown
InChI: InChI=1S/C5H10N2O7P2/c8-5(15(9,10)11,16(12,13)14)3-7-2-1-6-4-7/h1-2,4,8-10,12-13H,3H2
charge 0 multiplicity 1
26 atoms
P  -0.360514 1.651334 0.307532
P  -2.50796 -0.585641 -0.350305
O  -0.58501 -0.655376 1.642163
O  -1.668052 2.265039 1.256501
O  -0.954291 1.894552 -1.294913
O  -2.55159 -2.043348 0.624991
O  -2.273641 -1.233131 -1.945639
O  1.054561 2.257484 0.688062
O  -3.797547 0.331654 -0.229112
N  1.697847 -0.724868 -0.395706
N  3.853359 -0.140445 -0.798892
C  -0.68067 -0.231749 0.270928
C  0.287933 -0.992852 -0.672816
C  2.418902 -1.024181 0.773062
C  2.614799 -0.194421 -1.312747
C  3.736314 -0.65542 0.505764
H  0.06807 -2.07263 -0.56618
H  0.082335 -0.715268 -1.718875
H  -1.139808 -1.485405 1.74196
H  1.935425 -1.42213 1.659416
H  2.323593 0.126579 -2.310592
H  -1.387635 2.601299 2.146355
H  -1.046149 2.830499 -1.601345
H  -3.415838 -2.517918 0.685302
H  -2.89096 -0.832591 -2.610764
H  4.599529 -0.717268 1.16395
