program: Orca
programVersion: 4.2.1
elementType: Cl F F F O N N N C C C C C C C C C C C C C C C H H H H H H H H H H H H H H H
charge: 0
multiplicity: 1
keywords: wb97x-d3
keywords: def2-TZVPP
keywords: def2/J RIJCOSX GRIDX6 NOFINALGRIDX
keywords: grid4 nofinalgrid
keywords: scfconv7
keywords: smallprint printgap noloewdin
keywords: NOSOSCF
formula: C15H15ClF3N3O
InChI: InChI=1/C15H15ClF3N3O/c1-2-7-23-9-14(22-6-5-20-10-22)21-13-4-3-11(16)8-12(13)15(17,18)19/h3-6,8,10H,2,7,9H2,1H3
38 atoms
Cl -4.8468 1.672648 0.172867
F  -2.618795 -2.874567 1.155903
F  -1.22715 -3.131921 -0.457798
F  -0.548297 -2.376697 1.438729
O  1.776443 1.77915 0.41907
N  2.660404 -1.074567 -0.552642
N  0.420022 -0.794743 -0.806874
N  4.026307 -2.475293 -1.564406
C  1.462318 -0.46891 -0.1739
C  1.52488 0.517485 0.966029
C  1.628811 2.818569 1.36746
C  -0.807667 -0.201951 -0.52909
C  1.698645 4.157105 0.668675
C  -1.826333 -0.925034 0.100864
C  -1.068607 1.100353 -0.948341
C  -3.067667 -0.344091 0.31995
C  3.940408 -0.700826 -0.195344
C  3.020348 4.423814 -0.033568
C  2.784517 -2.151481 -1.386155
C  -1.55853 -2.326776 0.556891
C  -2.307044 1.679088 -0.740424
C  -3.298209 0.953561 -0.101157
C  4.759321 -1.57359 -0.831301
H  2.28593 0.215903 1.696246
H  0.563676 0.489543 1.494228
H  2.411346 2.746216 2.135601
H  0.664127 2.719482 1.88275
H  0.869675 4.238361 -0.04015
H  1.523221 4.922712 1.429533
H  -0.297886 1.659519 -1.459746
H  -3.856439 -0.890981 0.816845
H  4.154721 0.139466 0.441872
H  3.206452 3.712618 -0.839058
H  3.030953 5.422202 -0.472543
H  3.859678 4.364038 0.662236
H  1.924322 -2.648333 -1.804222
H  -2.489204 2.691568 -1.074282
H  5.837027 -1.604088 -0.804455
elementType: Cl F O N C H
totalener: -1579.97754712 hartree
nucrepener: 2141.15122786 hartree
electener: -3721.12877498 hartree
oneelecener: -6423.96792031 hartree
twoeener: 2702.83914532 hartree
cpcmener: -0.02243751 hartree
kineticenergy: 1574.93983415 hartree
xcener: -123.747958995170 hartree
chargesum: 0.0000000
charge: -0.087328 -0.177191 -0.174475 -0.181344 -0.336219 -0.025136 -0.312795 -0.374443 0.258453 -0.028209 0.019520 0.113431 -0.109959 -0.158182 -0.181707 -0.081795 -0.120512 -0.253970 0.070379 0.556261 -0.125809 0.090164 -0.123241 0.123957 0.121307 0.092513 0.088314 0.060922 0.068710 0.149032 0.133093 0.179807 0.080752 0.091642 0.076064 0.164446 0.146971 0.166578
qa: -0.0873 -0.1772 -0.1745 -0.1813 -0.3362 -0.0251 -0.3128 -0.3744 0.2585 -0.0282 0.0195 0.1134 -0.1100 -0.1582 -0.1817 -0.0818 -0.1205 -0.2540 0.0704 0.5563 -0.1258 0.0902 -0.1232 0.1240 0.1213 0.0925 0.0883 0.0609 0.0687 0.1490 0.1331 0.1798 0.0808 0.0916 0.0761 0.1644 0.1470 0.1666
va: 1.2159 1.1264 1.1262 1.1130 1.9327 3.3476 3.0260 3.1169 3.8858 3.9797 3.8780 3.9351 3.9387 3.8463 3.9821 3.9791 3.9095 3.9178 4.0209 4.4278 4.0012 3.8619 4.0356 0.9915 0.9954 0.9951 0.9981 1.0102 1.0119 1.0096 1.0243 0.9903 1.0110 1.0048 1.0032 1.0124 1.0031 0.9995
dispcorr: -0.018785116 hartree
energy: -1579.996332234325
dipole: 33.46517 -33.41034 0.05482 32.54935 -29.95984 2.58951 1.44605 0.13077 1.57682
magnitude: 3.03231 au
magnitude: 7.70752 debye
