program: Orca
programVersion: 4.2.1
elementType: Cl F F F O N N N C C C C C C C C C C C C C C C H H H H H H H H H H H H H H H
charge: 0
multiplicity: 1
keywords: wb97x-d3
keywords: def2-TZVPP
keywords: def2/J RIJCOSX GRIDX6 NOFINALGRIDX
keywords: grid4 nofinalgrid
keywords: scfconv7
keywords: smallprint printgap noloewdin
keywords: NOSOSCF
formula: C15H15ClF3N3O
InChI: InChI=1/C15H15ClF3N3O/c1-2-7-23-9-14(22-6-5-20-10-22)21-13-4-3-11(16)8-12(13)15(17,18)19/h3-6,8,10H,2,7,9H2,1H3
38 atoms
Cl -5.326044 1.027944 0.736115
F  -0.04413 -0.189647 -1.919992
F  -0.775615 -2.19083 -1.625723
F  -1.949775 -0.768691 -2.724767
O  2.234136 1.350647 -0.258604
N  2.423611 -1.180984 0.909999
N  0.158122 -1.134986 0.86827
N  4.554146 -1.653037 1.22284
C  1.227445 -0.46652 0.850787
C  1.346237 1.032913 0.770533
C  2.447413 2.741317 -0.393815
C  -1.102654 -0.554912 0.8120
C  3.549644 2.980043 -1.403296
C  -1.809874 -0.471583 -0.393577
C  -1.726716 -0.136844 1.984842
C  -3.108118 0.019451 -0.414321
C  2.548105 -2.548562 0.766437
C  3.778154 4.466789 -1.629717
C  3.676789 -0.701431 1.18633
C  -1.148948 -0.907129 -1.665426
C  -3.01941 0.354052 1.967673
C  -3.704001 0.42617 0.766065
C  3.862914 -2.811192 0.9556
H  1.688143 1.414992 1.74443
H  0.351962 1.462754 0.604131
H  2.724909 3.179686 0.575233
H  1.520788 3.237355 -0.714905
H  4.472031 2.51222 -1.04871
H  3.29054 2.496858 -2.349067
H  -1.194346 -0.210409 2.923919
H  -3.658856 0.088886 -1.341754
H  1.709059 -3.180993 0.536365
H  2.886622 4.952308 -2.030895
H  4.043925 4.978402 -0.702628
H  4.588955 4.635182 -2.338569
H  3.881922 0.341245 1.361879
H  -3.48509 0.675171 2.889448
H  4.356967 -3.768975 0.911722
elementType: Cl F O N C H
totalener: -1579.97898523 hartree
nucrepener: 2133.22364094 hartree
electener: -3713.20262616 hartree
oneelecener: -6408.49999331 hartree
twoeener: 2695.29736715 hartree
cpcmener: -0.02463017 hartree
kineticenergy: 1574.92660951 hartree
xcener: -123.747269467048 hartree
chargesum: 0.0000000
charge: -0.088150 -0.176476 -0.175322 -0.177250 -0.349717 -0.031495 -0.294705 -0.376141 0.225354 -0.007166 0.030225 0.055627 -0.077379 -0.152225 -0.165377 -0.084449 -0.117999 -0.277733 0.071647 0.562333 -0.111223 0.085545 -0.118645 0.149683 0.125959 0.075144 0.081596 0.061689 0.061173 0.151888 0.133964 0.179196 0.081674 0.080477 0.095027 0.159757 0.147233 0.166262
qa: -0.0882 -0.1765 -0.1753 -0.1773 -0.3497 -0.0315 -0.2947 -0.3761 0.2254 -0.0072 0.0302 0.0556 -0.0774 -0.1522 -0.1654 -0.0844 -0.1180 -0.2777 0.0716 0.5623 -0.1112 0.0855 -0.1186 0.1497 0.1260 0.0751 0.0816 0.0617 0.0612 0.1519 0.1340 0.1792 0.0817 0.0805 0.0950 0.1598 0.1472 0.1663
va: 1.2150 1.1196 1.1234 1.1263 1.9466 3.3260 3.0191 3.1168 3.9276 3.9697 3.8964 4.0049 3.9007 3.8436 3.9963 3.9807 3.9054 3.9558 4.0565 4.4164 3.9885 3.8521 4.0442 0.9851 0.9982 0.9919 0.9931 1.0098 1.0122 1.0014 1.0244 1.0062 1.0018 1.0011 1.0031 1.0018 1.0021 0.9999
dispcorr: -0.017881250 hartree
energy: -1579.996866476623
dipole: 35.18244 -35.95809 -0.77565 22.74592 -20.84043 1.90549 5.91135 -4.79019 1.12116
magnitude: 2.34298 au
magnitude: 5.95537 debye
