program: Orca
programVersion: 4.2.1
elementType: Cl F F F O N N N C C C C C C C C C C C C C C C H H H H H H H H H H H H H H H
charge: 0
multiplicity: 1
keywords: wb97x-d3
keywords: def2-TZVPP
keywords: def2/J RIJCOSX GRIDX6 NOFINALGRIDX
keywords: grid4 nofinalgrid
keywords: scfconv7
keywords: smallprint printgap noloewdin
keywords: NOSOSCF
formula: C15H15ClF3N3O
InChI: InChI=1/C15H15ClF3N3O/c1-2-7-23-9-14(22-6-5-20-10-22)21-13-4-3-11(16)8-12(13)15(17,18)19/h3-6,8,10H,2,7,9H2,1H3
38 atoms
Cl -4.646854 1.903714 0.556224
F  -2.607003 -2.369151 -1.495327
F  -0.531012 -1.863659 -1.720287
F  -1.180524 -3.033169 -0.035158
O  2.439789 1.594689 -0.219895
N  2.746351 -1.244169 0.435369
N  0.534838 -0.898731 0.830036
N  4.096094 -2.755088 1.303499
C  1.566003 -0.538393 0.19828
C  1.652387 0.588745 -0.797437
C  2.422654 2.814212 -0.944152
C  -0.672479 -0.218812 0.717891
C  1.208857 3.674321 -0.633877
C  -1.727609 -0.742509 -0.037687
C  -0.873885 0.964938 1.423183
C  -2.948934 -0.085259 -0.087969
C  3.98752 -1.037534 -0.135476
C  1.24729 4.980134 -1.413195
C  2.883962 -2.298825 1.297097
C  -1.515966 -2.003366 -0.818128
C  -2.091298 1.62018 1.379102
C  -3.122238 1.090294 0.621351
C  4.795118 -1.977635 0.411309
H  0.64012 0.931658 -1.029979
H  2.082209 0.220641 -1.739136
H  2.489861 2.619927 -2.023397
H  3.334217 3.346032 -0.659642
H  0.285622 3.138866 -0.874446
H  1.181362 3.879973 0.43976
H  -0.069338 1.370999 2.021922
H  -3.765716 -0.476868 -0.677978
H  4.189213 -0.266002 -0.857045
H  1.219976 4.80565 -2.490788
H  0.393831 5.61113 -1.163492
H  2.151441 5.552605 -1.195162
H  2.055872 -2.671313 1.877634
H  -2.225977 2.539784 1.932148
H  5.843813 -2.137212 0.215962
elementType: Cl F O N C H
totalener: -1579.97726667 hartree
nucrepener: 2144.71583705 hartree
electener: -3724.69310372 hartree
oneelecener: -6431.05905651 hartree
twoeener: 2706.36595280 hartree
cpcmener: -0.02359643 hartree
kineticenergy: 1574.91846372 hartree
xcener: -123.746417707503 hartree
chargesum: -0.0000000
charge: -0.086869 -0.177054 -0.181624 -0.173952 -0.363895 -0.032804 -0.311305 -0.373544 0.261144 -0.029321 0.020921 0.109262 -0.064573 -0.144077 -0.221954 -0.084626 -0.124556 -0.277891 0.068015 0.559151 -0.099448 0.086412 -0.122545 0.130920 0.143707 0.076263 0.102083 0.045511 0.061423 0.149776 0.134433 0.178819 0.084520 0.094290 0.083040 0.165687 0.148217 0.166447
qa: -0.0869 -0.1771 -0.1816 -0.1740 -0.3639 -0.0328 -0.3113 -0.3735 0.2611 -0.0293 0.0209 0.1093 -0.0646 -0.1441 -0.2220 -0.0846 -0.1246 -0.2779 0.0680 0.5592 -0.0994 0.0864 -0.1225 0.1309 0.1437 0.0763 0.1021 0.0455 0.0614 0.1498 0.1344 0.1788 0.0845 0.0943 0.0830 0.1657 0.1482 0.1664
va: 1.2169 1.1270 1.1121 1.1275 1.9274 3.3499 3.0035 3.1178 3.8663 3.9680 3.9208 3.9345 3.8540 3.8330 3.9845 3.9796 3.9225 3.9621 4.0188 4.4262 3.9662 3.8642 4.0356 0.9908 0.9880 0.9958 0.9957 1.0128 1.0120 1.0065 1.0241 0.9950 1.0005 1.0019 1.0018 1.0139 1.0012 0.9997
dispcorr: -0.018934460 hartree
energy: -1579.996201126047
dipole: 28.97336 -29.07343 -0.10007 30.96348 -28.22990 2.73358 -3.51436 2.29715 -1.21721
magnitude: 2.99400 au
magnitude: 7.61015 debye
