program: Gaussian 09
title: 000007527
version: EM64L-G09RevD.01
frameworkgroup: C1[X(C7H13N)]
method: RPBEPBE
basis: SDD
operation: Freq
keyword: #pfreq=noraman
keyword: PBEPBE/SDD
title: #p freq=noraman PBEPBE/SDD
converged: NO YES NO NO
title: Mulliken charges:
elementType: N C C C C C C C H H H H H H H H H H H H H
charge: -0.005373 -0.119116 -0.437287 -0.437204 -0.437313 -0.447015 -0.447387 -0.447143 0.212203 0.203221 0.203200 0.203288 0.203289 0.203312 0.203324 0.224296 0.224315 0.224391 0.224365 0.224345 0.224289
chargesum: 0.00000
title: Mulliken charges with hydrogens summed into heavy atoms:
elementType: N C C C C C C C
charge: -0.005373 0.093087 -0.030867 -0.030627 -0.030677 0.001596 0.001369 0.001491
polarizability: 7.22354022e+01 -2.16003191e-02 7.58182325e+01 -2.51850501e-03 -5.20666263e-03 7.58332848e+01
1716.lowfreq: -13.0615 -0.0009 -0.0006 -0.0005 7.0032 27.5767 68.2346 287.5104 290.3787
frequency: 67.8008 287.4940 290.3682 387.5130 389.9805 533.3142 535.6067 588.9268 742.8545 782.1306 785.6511 814.1464 816.8205 870.9011 873.7971 934.9962 947.2613 989.8898 992.6710 1009.5404 1050.5441 1052.8298 1117.0070 1117.6910 1139.0798 1196.5058 1196.9520 1229.4816 1263.4245 1265.6442 1302.4263 1302.5183 1308.8062 1311.5169 1312.6830 1327.6434 1343.0193 1343.9308 1456.9427 1459.0303 1467.2364 1469.0165 1470.8011 1486.3418 2971.6352 2972.2566 2972.4502 2989.6530 2990.2477 2994.3612 3021.7190 3026.7489 3027.2352 3030.4806 3050.1998 3059.6560 3060.0087
redmass: 1.7162 1.6954 1.7064 2.2131 2.2284 3.6007 3.5903 8.6246 4.7032 1.1832 3.5098 1.3453 1.3462 2.8080 2.8516 1.4477 4.3678 2.2972 2.2944 3.1545 2.8235 2.7968 1.4569 1.4534 1.0707 1.3704 1.3620 1.0926 1.4624 1.4504 1.2880 1.2933 1.4355 1.3756 1.3831 1.3194 1.4028 1.4179 1.0795 1.0791 1.0842 1.0846 1.0868 1.0898 1.0596 1.0586 1.0585 1.0602 1.0601 1.0633 1.1046 1.1038 1.1039 1.0865 1.1062 1.1058 1.1058
irintensity: 0.0010 0.5273 0.5444 0.3288 0.2882 0.8495 0.8455 10.1000 18.2178 0.0875 5.2510 6.0722 6.1222 2.2953 2.2441 0.0006 14.2097 6.5482 6.4185 2.6674 10.7301 10.4303 0.1126 0.0934 0.0056 5.6276 5.5319 0.0014 6.9420 6.9254 2.0246 2.1420 7.4204 1.8537 1.9353 0.0015 1.0097 0.9454 1.2021 1.4422 17.3140 17.1553 9.9433 0.9406 66.7758 18.5214 14.6623 110.9770 112.7005 39.9444 0.0241 8.4676 8.1191 56.6626 0.2062 99.6134 100.9344
temp: 298.150 k
press: 1.00000 atm
elementType: 7 6 6 6 6 6 6 6 1 1 1 1 1 1 1 1 1 1 1 1 1
symmnumber: 1
zpe: 501231.7 jmol-1
zpe.correction: 0.190909 hartree
zpe.thermalcorrener: 0.197670 hartree
zpe.thermalcorrenthalpy: 0.198614 hartree
zpe.thermalcorrgfe: 0.160082 hartree
zpe.sumelectzpe: -328.624001 hartree
zpe.sumelectthermal: -328.617241 hartree
zpe.sumelectthermalent: -328.616297 hartree
zpe.sumelectthermalfe: -328.654828 hartree
dipole: -1.4097 -0.0075 -0.0002
dipole: 1.4097
quadrupole: -55.1370 -48.2898 -48.2890
quadrupole: -0.0366 -0.0021 0.0015
quadrupole: -4.5650 2.2821 2.2829 -0.0366 -0.0021 0.0015
hfenergy: -328.8149104 hartree
pointgroup: C01 [X(C7H13N1)]
dipole: -0.554636 -0.00036 -0.000175 debye
dipolederiv: -0.661488 0.0000174 0.0002338 -0.0002954 -0.4241473 -0.0005606 -0.0001713 0.0000246 -0.4244535 0.1422441 -0.0001992 -0.000009 -0.0001003 0.0907007 -0.0003631 0.0000396 -0.0001296 0.0904272 -0.0707977 0.0074496 0.0017155 0.068723 -0.059319 -0.0372456 0.0145451 -0.0370908 0.1082654 -0.0708653 -0.0051706 0.0055989 -0.0469224 0.033712 0.0912148 0.0522391 0.0911893 0.0144447 -0.070713 -0.0025121 -0.0072301 -0.0219341 0.0986736 -0.053564 -0.0667365 -0.053731 -0.0501333 0.3315734 -0.015593 -0.0036787 -0.0031846 0.3690982 0.04456 -0.0006513 0.0443827 0.1704756 0.331657 0.0107995 -0.0115068 0.0023787 0.2589063 -0.1083676 -0.0024914 -0.1086634 0.2810893 0.3316972 0.0048552 0.0147774 0.0012951 0.1819611 0.0642814 0.0032306 0.0641445 0.3583957 -0.2186756 0.0000152 0.0000064 0.0000573 0.045434 -0.0000209 0.0000013 -0.0000581 0.045471 0.0006925 -0.0484339 -0.0658425 -0.0200741 0.0309426 -0.0674039 -0.1028429 -0.1262779 -0.1430938 0.0005688 -0.0710642 0.0403899 -0.060331 -0.0701792 0.1000405 0.0857669 0.1588067 -0.042022 0.0005497 0.0812542 -0.0090539 0.0992157 -0.183482 0.0024097 0.0341261 -0.056566 0.0712538 0.0003947 0.0005787 -0.0819324 -0.0441245 0.0630753 -0.0820959 -0.0952505 -0.0231296 -0.1749134 0.0006163 -0.0327032 0.0747932 -0.0791044 -0.0159378 0.1532942 0.0688005 0.0942396 -0.0960464 0.0003952 0.0706706 0.0415829 0.104623 -0.1610127 -0.1062051 0.0093989 -0.0472532 0.0491005 -0.008046 0.0454367 -0.0485288 0.050872 -0.0530573 0.0887141 -0.0936436 0.1573478 -0.0330503 -0.0080764 0.0218753 0.0629304 0.0083539 0.0417734 -0.0555639 0.1062717 -0.1239488 -0.1276779 -0.0078283 0.0192993 0.0636012 0.0556052 0.0685647 -0.0872778 0.0908961 -0.0186979 -0.1546541 -0.008024 -0.065461 -0.0124381 -0.0962914 -0.1634146 0.0061461 -0.0457296 -0.0625608 0.077203 -0.0079135 -0.0645418 -0.0151159 -0.1065016 -0.1446519 -0.1046612 0.0026231 -0.0359629 0.0583176 -0.0079611 0.0434271 -0.0502934 0.08774 -0.00764 0.152669 -0.060422 0.0839347 -0.0783992 unknown
polarizability: 72.2352746|-0.0008058|75.8346589|-0.0039247|0.0021402|75.8169859 unknown
InChI: InChI=1S/C7H13N/c1-4-8-5-2-7(1)3-6-8/h7H,1-6H2
charge 0 multiplicity 1
21 atoms
N  1.289524 0.00072 0.000317
C  -1.311388 0.000223 0.000213
C  -0.783323 -1.430981 -0.305003
C  -0.783448 0.979451 -1.08639
C  -0.783684 0.450999 1.391648
C  0.7901 -1.377703 -0.293363
C  0.78962 0.943025 -1.046804
C  0.789275 0.435127 1.340154
H  -2.416559 0.000091 0.000144
H  -1.162164 -1.770963 -1.288658
H  -1.162684 -2.142519 0.454292
H  -1.162808 2.001053 -0.888782
H  -1.163296 0.677292 -2.081869
H  -1.162694 -0.23129 2.177301
H  -1.163849 1.464075 1.627686
H  1.206902 -2.058794 0.472015
H  1.207242 -1.688335 -1.269505
H  1.205881 0.620058 -2.019324
H  1.206753 1.943951 -0.828833
H  1.205624 1.438647 1.547539
H  1.206277 -0.254928 2.097223
