program: Orca
programVersion: 4.2.1
elementType: Cl F F F O N N N C C C C C C C C C C C C C C C H H H H H H H H H H H H H H H
charge: 0
multiplicity: 1
keywords: wb97x-d3
keywords: def2-TZVPP
keywords: def2/J RIJCOSX GRIDX6 NOFINALGRIDX
keywords: grid4 nofinalgrid
keywords: scfconv7
keywords: smallprint printgap noloewdin
keywords: NOSOSCF
formula: C15H15ClF3N3O
InChI: InChI=1/C15H15ClF3N3O/c1-2-7-23-9-14(22-6-5-20-10-22)21-13-4-3-11(16)8-12(13)15(17,18)19/h3-6,8,10H,2,7,9H2,1H3
38 atoms
Cl -4.406049 2.040968 0.862718
F  -0.847215 -2.721534 -0.21419
F  -2.281046 -1.941114 -1.609739
F  -0.209294 -1.414228 -1.795362
O  1.039497 1.292994 -1.136682
N  2.955625 -1.336795 0.555065
N  0.820065 -0.688483 0.937534
N  4.147396 -2.875513 1.590206
C  1.85942 -0.51902 0.250693
C  2.098655 0.431111 -0.904337
C  1.183319 2.574737 -0.550018
C  -0.383986 -0.012916 0.836311
C  0.008641 3.438334 -0.949693
C  -1.413838 -0.449624 -0.007351
C  -0.650658 1.027309 1.725546
C  -2.647175 0.1876 0.001422
C  4.175506 -1.393489 -0.091038
C  -0.089193 3.68595 -2.44761
C  3.006714 -2.261576 1.56231
C  -1.190373 -1.625925 -0.904986
C  -1.876654 1.664274 1.735501
C  -2.867987 1.246033 0.863375
C  4.886387 -2.344671 0.561842
H  2.266663 -0.17399 -1.80171
H  3.034386 0.972994 -0.717806
H  2.121145 3.035581 -0.88945
H  1.242368 2.50154 0.542963
H  -0.916108 2.987531 -0.580225
H  0.116479 4.3902 -0.423264
H  0.118261 1.336704 2.420926
H  -3.441107 -0.136389 -0.656763
H  4.431332 -0.779118 -0.936452
H  -0.907916 4.369852 -2.675175
H  0.827575 4.133748 -2.837587
H  -0.27101 2.764929 -3.001691
H  2.177445 -2.423352 2.230989
H  -2.053386 2.47935 2.424253
H  5.889666 -2.678171 0.348581
elementType: Cl F O N C H
totalener: -1579.97618529 hartree
nucrepener: 2206.43482041 hartree
electener: -3786.41100570 hartree
oneelecener: -6554.94905231 hartree
twoeener: 2768.53804661 hartree
cpcmener: -0.02523790 hartree
kineticenergy: 1574.92071674 hartree
xcener: -123.753726479337 hartree
chargesum: 0.0000000
charge: -0.096576 -0.178886 -0.179183 -0.178981 -0.340465 -0.037807 -0.326060 -0.375418 0.248819 -0.010228 -0.022156 0.150441 -0.100588 -0.134971 -0.196981 -0.096891 -0.122106 -0.264421 0.070011 0.553304 -0.159907 0.109669 -0.121510 0.147632 0.125186 0.108473 0.113924 0.051996 0.075899 0.152842 0.129676 0.176155 0.092361 0.079289 0.081278 0.165262 0.143513 0.167403
qa: -0.0966 -0.1789 -0.1792 -0.1790 -0.3405 -0.0378 -0.3261 -0.3754 0.2488 -0.0102 -0.0222 0.1504 -0.1006 -0.1350 -0.1970 -0.0969 -0.1221 -0.2644 0.0700 0.5533 -0.1599 0.1097 -0.1215 0.1476 0.1252 0.1085 0.1139 0.0520 0.0759 0.1528 0.1297 0.1762 0.0924 0.0793 0.0813 0.1653 0.1435 0.1674
va: 1.2053 1.1178 1.1243 1.1151 1.9617 3.3403 3.0260 3.1158 3.8183 3.9839 3.8615 3.9033 3.8982 3.8329 3.9211 3.9884 3.9093 3.9320 4.0204 4.4298 3.9949 3.7821 4.0355 0.9891 0.9918 0.9956 0.9878 1.0191 1.0134 1.0031 1.0255 0.9923 1.0044 1.0027 1.0108 1.0141 1.0056 0.9993
dispcorr: -0.020842938 hartree
energy: -1579.997028224660
dipole: 22.91162 -21.83768 1.07394 24.26323 -21.75247 2.51076 -3.96380 3.44202 -0.52178
magnitude: 2.78020 au
magnitude: 7.06671 debye
