program: Gaussian 09
title: 000073716
version: EM64L-G09RevD.01
frameworkgroup: C1[X(C12H14O3)]
method: RPBEPBE
basis: SDD
operation: Freq
keyword: #pfreq=noraman
keyword: PBEPBE/SDD
title: #p freq=noraman PBEPBE/SDD
converged: YES YES NO NO
title: Mulliken charges:
elementType: O O O C C C C C C C C C C C C H H H H H H H H H H H H H H
charge: -0.257212 -0.246573 -0.227684 0.456646 -0.647315 -0.373159 -0.418337 0.296979 -0.340130 -0.348560 0.282395 0.125373 -0.229716 -0.790516 -0.672217 0.241418 0.247794 0.265672 0.238460 0.242522 0.277957 0.230363 0.232684 0.238001 0.238397 0.260247 0.213531 0.232788 0.230193
chargesum: 0.00000
title: Mulliken charges with hydrogens summed into heavy atoms:
elementType: O O O C C C C C C C C C C C C
charge: -0.257212 -0.246573 -0.227684 0.456646 -0.158103 -0.107487 -0.179877 0.296979 -0.097608 -0.070603 0.282395 0.125373 0.233332 -0.053872 0.004294
polarizability: 1.94690426e+02 -5.83069370e+00 1.31355047e+02 -1.56790424e+01 -1.15465540e+01 9.79893606e+01
1716.lowfreq: -8.0830 -2.3023 -0.0006 -0.0006 -0.0005 4.0165 10.3287 25.2057 43.9278
frequency: 3.6084 24.8549 43.8784 59.4411 69.8494 106.8785 134.3530 150.9129 165.7209 193.0477 250.5432 266.1476 304.0345 340.0757 356.5337 400.6171 405.2561 448.6039 473.5209 544.0430 585.9726 596.2626 632.2801 669.7056 713.8832 760.1959 790.7375 797.6173 816.3801 853.8044 867.0156 917.4332 937.7775 951.1754 978.0564 996.6516 1011.2257 1023.2354 1027.3755 1072.4980 1098.2460 1114.9052 1126.5152 1135.2448 1193.3886 1207.9481 1227.1651 1249.2806 1274.1209 1287.7856 1314.5001 1356.3992 1369.9291 1385.7590 1402.0880 1411.9539 1447.4018 1452.1735 1461.2080 1463.7387 1473.2326 1486.0107 1500.6075 1565.8594 1598.1382 1618.4385 1634.7339 2985.0419 2997.1932 3012.9499 3014.5121 3069.1095 3072.0539 3093.8819 3099.1934 3109.2655 3125.2498 3131.9124 3137.9131 3156.9319 3161.0739
redmass: 3.8774 3.8595 2.6306 5.7930 4.6579 3.9481 1.0557 3.4708 3.0558 3.8613 1.4157 4.4193 3.8402 4.2219 3.9011 2.5150 2.8069 3.7285 3.5023 5.1751 4.0499 2.6050 6.6990 4.6030 3.8227 4.6067 3.4263 1.1091 2.6849 1.4798 1.6868 4.9060 2.0763 2.0779 1.3907 1.3812 3.1412 2.4371 1.8270 2.4903 1.8004 2.1595 1.4146 1.4684 1.1433 2.7501 1.6238 1.1410 3.7886 1.5560 1.3663 1.4203 1.2669 4.7475 1.2672 3.0293 1.0971 1.0958 1.0498 1.0402 1.0624 1.0672 2.5155 6.5616 7.5285 6.7658 9.3754 1.0376 1.0359 1.0582 1.0623 1.0968 1.1066 1.0985 1.0994 1.1028 1.0991 1.0889 1.0878 1.0953 1.0968
irintensity: 0.9641 2.5666 0.8458 1.8779 3.8075 0.4154 0.5254 8.3371 2.7494 1.5484 1.0527 2.3234 4.9174 11.3338 2.6557 1.5255 0.3068 1.4847 7.4090 11.7268 6.5623 21.4617 0.8591 12.1042 3.5229 2.7805 4.5028 3.8709 23.0530 14.9985 30.6644 12.8576 48.1298 6.7315 1.0368 2.3931 14.1755 79.9006 0.7142 4.0602 153.9911 7.6072 102.4412 6.6552 16.1488 0.4867 193.7261 4.4607 218.6559 69.1687 8.1265 1.2232 50.5663 25.8492 22.1420 29.7644 29.8325 13.9738 20.7069 11.8227 4.6087 13.6774 1.5936 69.4962 156.4591 13.1946 158.0223 3.3583 20.3206 16.7903 9.5221 12.4043 7.2829 27.7292 6.2264 43.8553 18.6432 9.2028 4.4860 13.7845 1.0218
temp: 298.150 k
press: 1.00000 atm
elementType: 8 8 8 6 6 6 6 6 6 6 6 6 6 6 6 1 1 1 1 1 1 1 1 1 1 1 1 1 1
symmnumber: 1
zpe: 608685.4 jmol-1
zpe.correction: 0.231836 hartree
zpe.thermalcorrener: 0.247366 hartree
zpe.thermalcorrenthalpy: 0.248310 hartree
zpe.thermalcorrgfe: 0.184630 hartree
zpe.sumelectzpe: -690.246446 hartree
zpe.sumelectthermal: -690.230916 hartree
zpe.sumelectthermalent: -690.229972 hartree
zpe.sumelectthermalfe: -690.293652 hartree
dipole: -3.2329 0.9735 -0.0565
dipole: 3.3768
quadrupole: -88.3378 -92.6522 -83.8349
quadrupole: 18.1692 -1.0516 -0.6136
quadrupole: -0.0628 -4.3772 4.4401 18.1692 -1.0516 -0.6136
hfenergy: -690.4782822 hartree
pointgroup: C01 [X(C12H14O3)]
dipole: 1.2446204 0.4525518 -0.1053147 debye
polarizability: 192.4909926|6.3738819|134.9485577|-21.0736522|3.3715798|96.5952836 unknown
InChI: InChI=1S/C12H14O3/c1-3-15-12(14)8-10-4-6-11(7-5-10)9(2)13/h4-7H,3,8H2,1-2H3
charge 0 multiplicity 1
29 atoms
O  3.514055 -0.024821 -0.332251
O  2.635243 2.134222 -0.339734
O  -4.228283 -1.522985 0.613357
C  0.234105 0.203717 -1.145036
C  1.621221 0.380754 -1.761883
C  -0.481762 1.321389 -0.642973
C  -0.360326 -1.082494 -1.070589
C  -2.363418 -0.131245 -0.013625
C  -1.76437 1.155591 -0.083839
C  -1.642362 -1.248583 -0.514195
C  2.61729 0.952226 -0.755558
C  -3.729552 -0.359128 0.571869
C  4.519569 0.403351 0.695119
C  -4.50655 0.835807 1.116317
C  5.38512 -0.814778 0.996754
H  2.000478 -0.580107 -2.142767
H  1.565454 1.097079 -2.602508
H  -0.020621 2.31447 -0.681506
H  0.187045 -1.953193 -1.449995
H  -2.296815 2.033605 0.296763
H  -2.114129 -2.234989 -0.452001
H  5.098807 1.247408 0.279416
H  3.9689 0.766155 1.581599
H  -4.688918 1.585453 0.323647
H  -3.946322 1.340249 1.925548
H  -5.472702 0.485969 1.509931
H  6.145106 -0.5535 1.755483
H  4.774379 -1.645405 1.389449
H  5.906559 -1.163817 0.089208
