program: Orca
programVersion: 4.2.1
elementType: Cl F F F O N N N C C C C C C C C C C C C C C C H H H H H H H H H H H H H H H
charge: 0
multiplicity: 1
keywords: wb97x-d3
keywords: def2-TZVPP
keywords: def2/J RIJCOSX GRIDX6 NOFINALGRIDX
keywords: grid4 nofinalgrid
keywords: scfconv7
keywords: smallprint printgap noloewdin
keywords: NOSOSCF
formula: C15H15ClF3N3O
InChI: InChI=1/C15H15ClF3N3O/c1-2-7-23-9-14(22-6-5-20-10-22)21-13-4-3-11(16)8-12(13)15(17,18)19/h3-6,8,10H,2,7,9H2,1H3
38 atoms
Cl -5.219942 1.431316 -0.35272
F  -2.170463 -1.90195 2.106464
F  -0.954667 -2.72925 0.541879
F  -0.182819 -1.152469 1.787994
O  2.46847 1.790258 0.307015
N  2.517225 -0.645986 -1.185497
N  0.258555 -0.637188 -1.026261
N  4.630341 -1.055253 -1.684443
C  1.326609 0.031988 -0.940582
C  1.436907 1.505066 -0.576951
C  2.289733 1.258154 1.606492
C  -1.004243 -0.102353 -0.839296
C  3.417105 1.743439 2.492048
C  -1.818333 -0.568591 0.201667
C  -1.537532 0.822726 -1.735118
C  -3.109467 -0.086763 0.350432
C  2.633658 -2.016823 -1.320865
C  3.456121 3.255605 2.659645
C  3.771471 -0.127964 -1.421531
C  -1.28123 -1.59326 1.158401
C  -2.82922 1.296466 -1.594034
C  -3.610084 0.843947 -0.54489
C  3.936108 -2.238144 -1.616692
H  0.46375 1.827788 -0.185574
H  1.622176 2.085398 -1.486474
H  2.283704 0.161277 1.580648
H  1.319505 1.578621 2.012886
H  3.294972 1.263871 3.466384
H  4.367452 1.381067 2.092046
H  -0.934681 1.156221 -2.570012
H  -3.737031 -0.432927 1.158782
H  1.790999 -2.670193 -1.184778
H  2.520129 3.631441 3.076749
H  4.257761 3.551155 3.335977
H  3.623052 3.760672 1.709551
H  3.987703 0.926017 -1.38294
H  -3.225193 2.012736 -2.300583
H  4.422617 -3.185265 -1.78473
totalener: -1579.95750933 hartree
nucrepener: 2150.88209177 hartree
electener: -3730.83960110 hartree
oneelecener: -6443.44208328 hartree
twoeener: 2712.60248218 hartree
kineticenergy: 1574.95031634 hartree
xcener: -123.752108865666 hartree
chargesum: 0.0000000
charge: -0.065922 -0.171629 -0.160523 -0.172289 -0.332938 -0.042828 -0.284193 -0.294070 0.164181 -0.004614 -0.001360 0.121009 -0.109609 -0.178791 -0.168890 -0.081157 -0.106397 -0.238837 0.048260 0.548571 -0.100571 0.076619 -0.077994 0.115421 0.127809 0.101076 0.084422 0.062387 0.069829 0.137970 0.130682 0.164180 0.066174 0.087333 0.087297 0.140935 0.127064 0.131393
qa: -0.0659 -0.1716 -0.1605 -0.1723 -0.3329 -0.0428 -0.2842 -0.2941 0.1642 -0.0046 -0.0014 0.1210 -0.1096 -0.1788 -0.1689 -0.0812 -0.1064 -0.2388 0.0483 0.5486 -0.1006 0.0766 -0.0780 0.1154 0.1278 0.1011 0.0844 0.0624 0.0698 0.1380 0.1307 0.1642 0.0662 0.0873 0.0873 0.1409 0.1271 0.1314
va: 1.2390 1.1328 1.1452 1.1176 1.9544 3.3153 2.9938 3.1402 3.8495 3.9824 3.8929 3.9442 3.9414 3.8917 3.9901 3.9633 3.8902 3.9184 4.0500 4.4271 4.0169 3.9392 4.0409 1.0010 0.9862 0.9960 0.9981 1.0111 1.0133 1.0015 1.0253 1.0125 1.0055 1.0067 1.0123 1.0137 1.0100 1.0078
dispcorr: -0.019189776 hartree
energy: -1579.976699107305
dipole: 34.40395 -35.02737 -0.62341 19.37977 -18.33703 1.04274 3.29576 -3.29005 0.00571
magnitude: 1.21490 au
magnitude: 3.08803 debye
