program: Orca
programVersion: 4.2.1
elementType: Cl F F F O N N N C C C C C C C C C C C C C C C H H H H H H H H H H H H H H H
charge: 0
multiplicity: 1
keywords: wb97x-d3
keywords: def2-TZVPP
keywords: def2/J RIJCOSX GRIDX6 NOFINALGRIDX
keywords: grid4 nofinalgrid
keywords: scfconv7
keywords: smallprint printgap noloewdin
keywords: NOSOSCF
formula: C15H15ClF3N3O
InChI: InChI=1/C15H15ClF3N3O/c1-2-7-23-9-14(22-6-5-20-10-22)21-13-4-3-11(16)8-12(13)15(17,18)19/h3-6,8,10H,2,7,9H2,1H3
38 atoms
Cl -4.45185 2.041923 -0.365306
F  0.143881 -1.222676 1.737975
F  -1.916649 -1.793371 1.944201
F  -0.709097 -2.676039 0.402616
O  1.183948 1.487464 0.39292
N  2.85867 -1.365952 -1.063192
N  0.681049 -0.744296 -1.171486
N  3.865613 -3.064585 -2.051587
C  1.818623 -0.508438 -0.694468
C  2.224357 0.590753 0.261821
C  1.190912 2.250782 1.576095
C  -0.496721 -0.057453 -0.927487
C  -0.070627 3.087147 1.621101
C  -1.360869 -0.434784 0.105659
C  -0.905484 0.942612 -1.806628
C  -2.576279 0.215701 0.2743
C  4.177201 -1.345557 -0.646529
C  -0.133779 3.937243 2.881519
C  2.743435 -2.438706 -1.910934
C  -0.966272 -1.534703 1.042683
C  -2.111777 1.590839 -1.637974
C  -2.943037 1.230181 -0.589186
C  4.768314 -2.395332 -1.268022
H  3.135052 1.077518 -0.118251
H  2.49689 0.116102 1.2173
H  2.077646 2.900422 1.615316
H  1.237187 1.590814 2.454508
H  -0.111128 3.725507 0.735639
H  -0.938402 2.425595 1.567453
H  -0.254736 1.217162 -2.625324
H  -3.243533 -0.063827 1.076783
H  4.573508 -0.616122 0.037004
H  -0.120517 3.321554 3.782224
H  0.70744 4.629589 2.942569
H  -1.046694 4.530459 2.906552
H  1.804858 -2.688134 -2.377199
H  -2.406059 2.37578 -2.320929
H  5.796557 -2.710653 -1.194436
totalener: -1579.95350286 hartree
nucrepener: 2198.07812617 hartree
electener: -3778.03162904 hartree
oneelecener: -6538.22194232 hartree
twoeener: 2760.19031329 hartree
kineticenergy: 1574.95593872 hartree
xcener: -123.756365326738 hartree
chargesum: -0.0000000
charge: -0.078396 -0.184840 -0.171806 -0.161529 -0.299891 -0.037926 -0.319440 -0.294344 0.254662 -0.044071 0.010077 0.208987 -0.086070 -0.188945 -0.159200 -0.115013 -0.119195 -0.258483 0.064682 0.563241 -0.106094 0.079760 -0.086362 0.110539 0.107425 0.075427 0.073327 0.066990 0.064963 0.112572 0.124796 0.141676 0.077408 0.076698 0.092476 0.153040 0.121219 0.131640
qa: -0.0784 -0.1848 -0.1718 -0.1615 -0.2999 -0.0379 -0.3194 -0.2943 0.2547 -0.0441 0.0101 0.2090 -0.0861 -0.1889 -0.1592 -0.1150 -0.1192 -0.2585 0.0647 0.5632 -0.1061 0.0798 -0.0864 0.1105 0.1074 0.0754 0.0733 0.0670 0.0650 0.1126 0.1248 0.1417 0.0774 0.0767 0.0925 0.1530 0.1212 0.1316
va: 1.2253 1.1023 1.1339 1.1440 1.9862 3.3405 3.0342 3.1338 3.8735 4.0011 3.9223 3.9031 3.9190 3.8381 4.0534 3.9344 3.8956 3.9654 4.0236 4.4112 4.0022 3.8688 4.0568 0.9904 0.9848 0.9908 0.9967 1.0104 1.0083 1.0135 1.0288 1.0047 1.0026 1.0038 1.0057 1.0157 1.0107 1.0069
dispcorr: -0.020206983 hartree
energy: -1579.973709844435
dipole: 21.31326 -20.57163 0.74163 23.03204 -21.22261 1.80943 5.78619 -5.09222 0.69397
magnitude: 2.07500 au
magnitude: 5.27424 debye
