program: Orca
programVersion: 4.2.1
elementType: Cl F F F O N N N C C C C C C C C C C C C C C C H H H H H H H H H H H H H H H
charge: 0
multiplicity: 1
keywords: wb97x-d3
keywords: def2-TZVPP
keywords: def2/J RIJCOSX GRIDX6 NOFINALGRIDX
keywords: grid4 nofinalgrid
keywords: scfconv7
keywords: smallprint printgap noloewdin
keywords: NOSOSCF
formula: C15H15ClF3N3O
InChI: InChI=1/C15H15ClF3N3O/c1-2-7-23-9-14(22-6-5-20-10-22)21-13-4-3-11(16)8-12(13)15(17,18)19/h3-6,8,10H,2,7,9H2,1H3
38 atoms
Cl -5.223208 1.272044 -0.413048
F  -1.812117 -1.322451 2.437945
F  -0.653777 -2.43564 1.0112
F  0.084049 -0.561459 1.769369
O  2.242036 1.381491 0.535127
N  2.510834 -0.786282 -1.283251
N  0.244398 -0.799805 -1.177145
N  3.858955 -2.431335 -1.879918
C  1.308867 -0.142513 -1.011076
C  1.398866 1.298566 -0.568628
C  2.319345 2.677243 1.084288
C  -1.019046 -0.270876 -0.958949
C  3.183755 2.636808 2.326888
C  -1.700566 -0.473958 0.247132
C  -1.672228 0.402892 -1.988706
C  -2.992966 0.004379 0.408361
C  3.784083 -0.249771 -1.35656
C  2.616499 1.756061 3.431113
C  2.63584 -2.115009 -1.614467
C  -1.020976 -1.205159 1.368133
C  -2.959351 0.881276 -1.82804
C  -3.615766 0.681413 -0.625507
C  4.585024 -1.276763 -1.727422
H  0.389189 1.659732 -0.3387
H  1.764072 1.906606 -1.413101
H  1.313459 3.043481 1.338328
H  2.73932 3.379868 0.349309
H  4.18839 2.302829 2.055346
H  3.289802 3.66389 2.685417
H  -1.161747 0.536148 -2.93336
H  -3.52289 -0.144734 1.338001
H  4.006191 0.775141 -1.125962
H  2.528454 0.719124 3.112196
H  3.256672 1.779387 4.312495
H  1.624964 2.094417 3.736591
H  1.782587 -2.77269 -1.632199
H  -3.449769 1.404118 -2.637489
H  5.650642 -1.255184 -1.888868
totalener: -1579.95533926 hartree
nucrepener: 2159.53686800 hartree
electener: -3739.49220726 hartree
oneelecener: -6460.97957797 hartree
twoeener: 2721.48737072 hartree
kineticenergy: 1574.95077992 hartree
xcener: -123.749780642602 hartree
chargesum: -0.0000000
charge: -0.068803 -0.172025 -0.160534 -0.166676 -0.316765 -0.034609 -0.285311 -0.293464 0.214682 -0.013017 0.004497 0.060616 -0.104906 -0.160598 -0.161110 -0.089203 -0.100468 -0.237942 0.057840 0.562062 -0.099709 0.078317 -0.088114 0.114710 0.121902 0.076474 0.079964 0.063166 0.059350 0.131498 0.130332 0.141655 0.094274 0.087491 0.067278 0.151261 0.126592 0.129297
qa: -0.0688 -0.1720 -0.1605 -0.1667 -0.3168 -0.0346 -0.2853 -0.2935 0.2147 -0.0130 0.0045 0.0606 -0.1049 -0.1606 -0.1611 -0.0892 -0.1005 -0.2379 0.0578 0.5621 -0.0997 0.0783 -0.0881 0.1147 0.1219 0.0765 0.0800 0.0632 0.0593 0.1315 0.1303 0.1417 0.0943 0.0875 0.0673 0.1513 0.1266 0.1293
va: 1.2355 1.1327 1.1462 1.1324 1.9583 3.3389 3.0089 3.1359 3.9672 3.9495 3.9070 4.0366 3.9490 3.8694 3.9998 3.9752 3.9089 3.9235 4.0290 4.4118 4.0126 3.9242 4.0543 1.0024 0.9882 0.9924 0.9951 1.0131 1.0112 1.0086 1.0260 1.0116 1.0138 1.0061 1.0057 1.0150 1.0098 1.0077
dispcorr: -0.018572461 hartree
energy: -1579.973911719464
dipole: 32.03438 -32.14700 -0.11263 20.10634 -17.93097 2.17537 2.07274 -2.29270 -0.21996
magnitude: 2.18936 au
magnitude: 5.56492 debye
