program: Orca
programVersion: 4.2.1
elementType: Cl F F F O N N N C C C C C C C C C C C C C C C H H H H H H H H H H H H H H H
charge: 0
multiplicity: 1
keywords: wb97x-d3
keywords: def2-TZVPP
keywords: def2/J RIJCOSX GRIDX6 NOFINALGRIDX
keywords: grid4 nofinalgrid
keywords: scfconv7
keywords: smallprint printgap noloewdin
keywords: NOSOSCF
formula: C15H15ClF3N3O
InChI: InChI=1/C15H15ClF3N3O/c1-2-7-23-9-14(22-6-5-20-10-22)21-13-4-3-11(16)8-12(13)15(17,18)19/h3-6,8,10H,2,7,9H2,1H3
38 atoms
Cl -5.275035 1.070307 0.147353
F  -2.63877 -3.289014 0.912437
F  -1.200262 -3.277378 -0.681821
F  -0.624204 -2.644983 1.294004
O  1.715042 1.985957 0.351101
N  2.525299 -0.789052 -0.486165
N  0.262255 -0.771593 -0.662496
N  3.985975 -2.147365 -1.431413
C  1.285879 -0.279669 -0.112255
C  1.302289 0.792627 0.950157
C  1.77052 3.07003 1.251918
C  -1.021185 -0.311872 -0.419182
C  2.31291 4.285989 0.531504
C  -1.997997 -1.19319 0.06028
C  -1.392757 0.994867 -0.730873
C  -3.302051 -0.760817 0.240685
C  3.779698 -0.289662 -0.188625
C  3.729732 4.097254 0.008247
C  2.728676 -1.914443 -1.246871
C  -1.614358 -2.606267 0.392844
C  -2.696818 1.42358 -0.561252
C  -3.646844 0.543986 -0.072396
C  4.652542 -1.138653 -0.783967
H  1.977496 0.488277 1.76384
H  0.299234 0.880051 1.385306
H  2.417611 2.821565 2.107257
H  0.770447 3.278274 1.657416
H  1.639651 4.550193 -0.287779
H  2.282906 5.123082 1.23338
H  -0.647715 1.675206 -1.122145
H  -4.058186 -1.431642 0.62202
H  3.934479 0.617045 0.367614
H  3.781569 3.301707 -0.733738
H  4.096226 5.009321 -0.461563
H  4.419351 3.847519 0.817063
H  1.903038 -2.508926 -1.60259
H  -2.970644 2.43918 -0.811477
H  5.729012 -1.080926 -0.78708
totalener: -1579.95710191 hartree
nucrepener: 2123.04889635 hartree
electener: -3703.00599826 hartree
oneelecener: -6387.79503517 hartree
twoeener: 2684.78903690 hartree
kineticenergy: 1574.95570697 hartree
xcener: -123.750111601887 hartree
chargesum: 0.0000000
charge: -0.068474 -0.172671 -0.160777 -0.174471 -0.315616 -0.041317 -0.306000 -0.293344 0.264460 -0.084093 0.003011 0.112854 -0.094712 -0.174188 -0.167373 -0.080246 -0.115302 -0.251372 0.059858 0.551070 -0.103830 0.078008 -0.084870 0.125640 0.131534 0.078048 0.085105 0.064494 0.061593 0.136181 0.131045 0.143967 0.090211 0.093116 0.069263 0.152868 0.126128 0.130202
qa: -0.0685 -0.1727 -0.1608 -0.1745 -0.3156 -0.0413 -0.3060 -0.2933 0.2645 -0.0841 0.0030 0.1129 -0.0947 -0.1742 -0.1674 -0.0802 -0.1153 -0.2514 0.0599 0.5511 -0.1038 0.0780 -0.0849 0.1256 0.1315 0.0780 0.0851 0.0645 0.0616 0.1362 0.1310 0.1440 0.0902 0.0931 0.0693 0.1529 0.1261 0.1302
va: 1.2365 1.1311 1.1459 1.1228 1.9365 3.3520 3.0099 3.1371 3.8863 3.9595 3.8960 3.9518 3.9312 3.8885 3.9653 3.9662 3.8982 3.9226 4.0286 4.4371 4.0161 3.9332 4.0509 0.9953 0.9914 0.9916 0.9990 1.0131 1.0120 1.0220 1.0253 1.0068 1.0087 1.0088 1.0031 1.0138 1.0105 1.0075
dispcorr: -0.018397816 hartree
energy: -1579.975499726842
dipole: 36.80073 -36.75430 0.04643 35.69008 -33.49985 2.19024 2.28086 -1.22441 1.05645
magnitude: 2.43215 au
magnitude: 6.18205 debye
