program: Orca
programVersion: 4.2.1
elementType: Cl F F F O N N N C C C C C C C C C C C C C C C H H H H H H H H H H H H H H H
charge: 0
multiplicity: 1
keywords: wb97x-d3
keywords: def2-TZVPP
keywords: def2/J RIJCOSX GRIDX6 NOFINALGRIDX
keywords: grid4 nofinalgrid
keywords: scfconv7
keywords: smallprint printgap noloewdin
keywords: NOSOSCF
formula: C15H15ClF3N3O
InChI: InChI=1/C15H15ClF3N3O/c1-2-7-23-9-14(22-6-5-20-10-22)21-13-4-3-11(16)8-12(13)15(17,18)19/h3-6,8,10H,2,7,9H2,1H3
38 atoms
Cl -4.591453 2.019921 -0.256904
F  -1.276319 -3.027578 -0.350359
F  -0.556144 -2.131012 1.469615
F  -2.654854 -2.523339 1.217317
O  2.37474 1.66496 0.144025
N  2.748858 -1.233071 -0.579163
N  0.531593 -0.830488 -0.869098
N  4.002985 -2.834352 -1.435976
C  1.599459 -0.511767 -0.277349
C  1.743128 0.577337 0.758227
C  2.465664 2.812721 0.961656
C  -0.655794 -0.140406 -0.673986
C  1.173686 3.61272 1.036971
C  -1.732085 -0.744285 -0.01375
C  -0.824838 1.138197 -1.200711
C  -2.938563 -0.073592 0.11621
C  4.050883 -0.95849 -0.204522
C  1.340731 4.850789 1.906673
C  2.797209 -2.383197 -1.328013
C  -1.557155 -2.112911 0.57639
C  -2.030502 1.804678 -1.077784
C  -3.084168 1.195625 -0.418057
C  4.795432 -1.953449 -0.745039
H  2.32176 0.200184 1.614053
H  0.745946 0.827096 1.135087
H  3.253703 3.430248 0.524829
H  2.798609 2.540409 1.974303
H  0.875295 3.900691 0.026116
H  0.361652 2.997914 1.434481
H  0.000158 1.60503 -1.721932
H  -3.770509 -0.529924 0.632847
H  4.327136 -0.086321 0.359581
H  1.60129 4.587435 2.932953
H  2.12602 5.505537 1.525686
H  0.420452 5.431911 1.943762
H  1.904213 -2.826251 -1.737458
H  -2.147404 2.795514 -1.494622
H  5.863385 -2.085668 -0.680975
totalener: -1579.95499220 hartree
nucrepener: 2142.98084948 hartree
electener: -3722.93584168 hartree
oneelecener: -6427.57994157 hartree
twoeener: 2704.64409989 hartree
kineticenergy: 1574.95550240 hartree
xcener: -123.751263325604 hartree
chargesum: 0.0000000
charge: -0.068938 -0.159091 -0.177618 -0.171726 -0.316265 -0.040668 -0.299807 -0.294290 0.253528 -0.067480 0.010388 0.116180 -0.082136 -0.166622 -0.195834 -0.084973 -0.116270 -0.254591 0.058505 0.556081 -0.103091 0.085091 -0.083587 0.125698 0.124679 0.099582 0.063634 0.059946 0.054195 0.135599 0.131011 0.149537 0.078180 0.079462 0.092835 0.152419 0.126507 0.129929
qa: -0.0689 -0.1591 -0.1776 -0.1717 -0.3163 -0.0407 -0.2998 -0.2943 0.2535 -0.0675 0.0104 0.1162 -0.0821 -0.1666 -0.1958 -0.0850 -0.1163 -0.2546 0.0585 0.5561 -0.1031 0.0851 -0.0836 0.1257 0.1247 0.0996 0.0636 0.0599 0.0542 0.1356 0.1310 0.1495 0.0782 0.0795 0.0928 0.1524 0.1265 0.1299
va: 1.2360 1.1496 1.1180 1.1328 1.9542 3.3577 3.0190 3.1358 3.8948 3.9639 3.9225 3.9624 3.8595 3.8802 3.9741 3.9710 3.8990 3.9649 4.0293 4.4300 3.9899 3.9284 4.0440 0.9941 0.9927 0.9975 0.9977 1.0116 1.0108 1.0163 1.0255 1.0079 1.0034 1.0037 1.0044 1.0140 1.0101 1.0074
dispcorr: -0.019040807 hartree
energy: -1579.974033009031
dipole: 29.83836 -29.67943 0.15894 31.01592 -28.85009 2.16583 6.14825 -5.19051 0.95775
magnitude: 2.37347 au
magnitude: 6.03289 debye
