program: Gaussian 09
title: 000073709
version: EM64L-G09RevD.01
frameworkgroup: C1[X(C12H10O2)]
method: RPBEPBE
basis: SDD
operation: Freq
keyword: #pfreq=noraman
keyword: PBEPBE/SDD
title: #p freq=noraman PBEPBE/SDD
converged: YES YES NO NO
title: Mulliken charges:
elementType: O O C C C C C C C C C C C C H H H H H H H H H H
charge: -0.282635 -0.227459 0.395773 0.380149 -0.597805 -0.405170 0.368667 -0.407860 -0.406397 -0.338661 -0.240762 -0.242645 0.258610 -0.749941 0.262956 0.239139 0.239470 0.240823 0.304077 0.229092 0.229143 0.252436 0.246576 0.252425
chargesum: 0.00000
title: Mulliken charges with hydrogens summed into heavy atoms:
elementType: O O C C C C C C C C C C C C
charge: -0.282635 -0.227459 0.395773 0.380149 -0.334850 -0.166031 0.368667 -0.168391 -0.165575 -0.034583 -0.011670 -0.013502 0.258610 0.001496
polarizability: 2.34539340e+02 -7.54679513e+00 1.37487924e+02 -6.88808710e-02 1.77778697e-02 5.77423666e+01
1716.lowfreq: -3.9190 0.0004 0.0004 0.0006 6.8190 11.9513 24.9500 55.1567 76.4712
frequency: 24.7710 55.0715 76.4689 134.2169 149.0394 183.0511 251.3944 290.8569 310.6148 401.5416 405.0976 478.7318 479.5304 513.3926 529.8958 552.8624 608.8016 625.2498 649.2623 708.1014 758.9213 759.3961 779.4427 813.7324 834.7942 875.6739 912.3808 917.3155 952.7394 963.5378 987.1870 993.3991 996.5026 1022.3791 1039.2898 1115.6033 1144.9576 1159.6078 1173.5354 1180.0529 1234.2385 1245.2720 1273.2276 1354.1567 1383.1902 1406.0215 1423.4778 1438.4120 1451.8782 1454.0094 1457.7656 1510.4997 1578.7051 1602.5518 1642.7993 1657.3500 3008.5897 3096.7189 3121.5985 3127.0986 3133.8618 3143.9761 3144.5365 3153.9123 3162.8897 3211.2662
redmass: 6.3554 2.3281 1.3298 4.6364 5.2936 3.7240 8.3355 3.9215 5.0051 4.0994 3.1909 2.4822 5.0120 6.7541 3.5601 3.1830 5.8152 6.3732 3.0532 6.9214 4.9480 1.2945 2.5026 6.3748 1.2974 1.5250 1.7286 5.3823 4.1258 1.3822 1.3319 1.3503 1.9020 2.2534 1.6391 1.9226 1.6727 1.3958 1.0835 3.1613 2.6670 1.4550 1.7556 1.8216 1.2352 5.6261 3.5161 3.5580 1.0947 1.0466 2.3034 3.7293 7.4503 5.7806 7.0218 9.5259 1.0367 1.0974 1.0856 1.0890 1.0908 1.0952 1.1011 1.0922 1.1004 1.0944
irintensity: 2.5819 2.6316 0.3610 3.6827 0.0779 2.0142 2.6200 0.5524 1.3843 1.0462 0.2023 25.7379 10.2093 0.5567 0.0003 1.2764 1.7418 7.4600 0.4321 6.6726 5.0572 47.3363 0.2023 16.7460 36.8634 56.5556 18.5093 9.2241 33.1319 10.9191 0.1023 0.0404 148.2820 1.2094 9.3964 52.9558 106.6294 21.7372 1.3156 595.6410 80.6786 1.0296 9.7423 15.0253 55.9135 1.6572 5.3334 0.3319 24.0828 18.7700 28.2238 52.2323 4.0741 18.1782 12.8570 236.5580 1.6544 6.9668 2.9719 0.3690 10.6621 33.0584 12.0014 5.4121 33.7020 6.2765
temp: 298.150 k
press: 1.00000 atm
elementType: 8 8 6 6 6 6 6 6 6 6 6 6 6 6 1 1 1 1 1 1 1 1 1 1
symmnumber: 1
zpe: 485841.8 jmol-1
zpe.correction: 0.185047 hartree
zpe.thermalcorrener: 0.196895 hartree
zpe.thermalcorrenthalpy: 0.197839 hartree
zpe.thermalcorrgfe: 0.145693 hartree
zpe.sumelectzpe: -612.761977 hartree
zpe.sumelectthermal: -612.750129 hartree
zpe.sumelectthermalent: -612.749185 hartree
zpe.sumelectthermalfe: -612.801331 hartree
dipole: 0.5979 -1.7450 0.0148
dipole: 1.8446
quadrupole: -68.6842 -74.7028 -85.3536
quadrupole: 9.0505 -0.0813 0.0582
quadrupole: 7.5627 1.5440 -9.1067 9.0505 -0.0813 0.0582
hfenergy: -612.9470245 hartree
pointgroup: C01 [X(C12H10O2)]
dipole: 0.1925179 -0.6712157 -0.1976903 debye
dipolederiv: -2.5005843 0.2548939 0.0386775 0.3327082 -0.4568548 -0.0776155 0.0610124 -0.0788419 -0.2030017 -0.80956 -0.0412276 -0.020909 0.6236486 -0.8877641 -0.1669783 0.1784911 -0.1783534 -0.3463982 0.2490613 -0.0438998 -0.0102223 -0.0341299 -0.0775822 -0.0359002 -0.0077444 -0.0361203 0.0255896 0.0132573 -0.0288736 -0.0092898 -0.0590181 -0.1265864 -0.0518497 -0.0185712 -0.0510677 0.0215803 -0.3497325 0.0361366 0.0082386 0.0957525 -0.0024003 0.059385 0.0273211 0.0588525 -0.1724698 0.0192248 0.0130056 0.0064578 -0.0309438 0.1432077 0.0938905 -0.0066596 0.093951 -0.1324748 1.4055329 0.0352253 0.0315636 0.40712 0.1346679 0.0223978 0.1441717 0.0159676 0.0942663 -0.1146608 0.0329194 0.0109694 -0.0108682 0.0924902 0.082615 -0.002617 0.0832345 -0.1496092 0.0141851 0.0103653 0.0058662 0.1066229 0.0822209 0.078694 0.0357216 0.0770487 -0.1424897 -0.3314575 -0.037393 -0.0143033 -0.1050969 -0.0781409 0.0215571 -0.0342959 0.0219863 -0.146143 -0.0147247 -0.0815199 -0.0229663 -0.0727036 0.0809749 0.0730936 -0.0200234 0.0729287 -0.1364666 0.0272057 0.1076187 0.0360201 0.0736814 -0.0663611 0.0322545 0.0253261 0.0328614 -0.1566196 2.4115075 -0.1116974 0.0037551 -1.0401997 1.2030333 0.2814617 -0.2761477 0.2974037 0.29038 -0.3266506 -0.1571481 -0.052925 -0.2949536 -0.1594887 -0.0587243 -0.0932322 -0.0564427 0.0015533 0.082654 -0.0156865 -0.0061278 -0.0712762 -0.0156279 -0.0590095 -0.0230446 -0.0580894 0.153096 0.0411914 -0.0705336 -0.0235469 -0.0272522 -0.0604283 -0.0658589 -0.0101646 -0.0662818 0.1301293 0.0630979 -0.0797635 -0.0260724 -0.0111632 -0.0700712 -0.0703882 -0.0049306 -0.0713393 0.1348049 0.0617615 -0.0079649 -0.0038841 -0.0821387 -0.0744014 -0.0727646 -0.0267486 -0.0715506 0.1341518 0.1424089 0.0654392 0.0198725 0.0396883 0.0916014 -0.0274353 0.0118177 -0.0264863 0.1735859 -0.0368873 0.109376 0.0308502 0.1157014 -0.0076631 -0.050563 0.0327961 -0.0506469 0.1462255 -0.1342923 -0.0477855 -0.0191713 -0.0488319 0.0843197 -0.0250849 -0.0194047 -0.0250708 0.1549979 0.0772218 -0.0035605 0.0400607 0.0031925 0.1141717 -0.0539162 -0.0029128 -0.0619673 -0.0492114 -0.0677098 0.0474265 0.0105383 0.0932983 0.0448859 -0.0234791 0.0240541 -0.0244894 0.1226391 0.0779497 0.0146474 -0.0334517 -0.002838 0.0117969 0.0942184 0.0057854 0.1025134 0.051884 unknown
polarizability: 233.2096648|-13.6085526|131.8551074|-1.4659957|22.6474161|64.7048583 unknown
InChI: InChI=1S/C12H10O2/c1-9(13)14-12-7-6-10-4-2-3-5-11(10)8-12/h2-8H,1H3
charge 0 multiplicity 1
24 atoms
O  -2.468447 -0.46606 -0.185178
O  -3.670965 1.485129 0.379933
C  1.230009 -0.641138 -0.185265
C  1.615425 0.692505 0.233681
C  -0.15924 -0.956637 -0.30402
C  0.585653 1.647932 0.514268
C  -1.127543 0.007795 -0.019872
C  2.256016 -1.604614 -0.468064
C  3.008797 1.010202 0.352817
C  -0.769348 1.331606 0.395861
C  3.604547 -1.265166 -0.342784
C  3.985477 0.052698 0.070794
C  -3.642207 0.290402 0.021587
C  -4.840115 -0.588739 -0.263409
H  -0.476448 -1.956338 -0.618101
H  0.872701 2.65758 0.830973
H  1.965343 -2.613432 -0.784402
H  3.296847 2.019814 0.669421
H  -1.544253 2.066989 0.611377
H  4.380391 -2.007345 -0.560746
H  5.047643 0.30385 0.164017
H  -4.800078 -0.961331 -1.301555
H  -5.763532 -0.012752 -0.108686
H  -4.832175 -1.469749 0.401455
