program: Orca
programVersion: 4.2.1
elementType: Cl F F F O N N N C C C C C C C C C C C C C C C H H H H H H H H H H H H H H H
charge: 0
multiplicity: 1
keywords: wb97x-d3
keywords: def2-TZVPP
keywords: def2/J RIJCOSX GRIDX6 NOFINALGRIDX
keywords: grid4 nofinalgrid
keywords: scfconv7
keywords: smallprint printgap noloewdin
keywords: NOSOSCF
formula: C15H15ClF3N3O
InChI: InChI=1/C15H15ClF3N3O/c1-2-7-23-9-14(22-6-5-20-10-22)21-13-4-3-11(16)8-12(13)15(17,18)19/h3-6,8,10H,2,7,9H2,1H3
38 atoms
Cl -5.324005 0.962318 0.803872
F  -0.769172 -2.424566 -1.235963
F  -2.062911 -1.264334 -2.497047
F  -0.135842 -0.492551 -1.943313
O  2.339311 2.034137 0.31562
N  2.552207 -0.715108 1.022148
N  0.293036 -0.821928 0.906397
N  3.994508 -2.382579 0.88048
C  1.313186 -0.081387 0.984367
C  1.310929 1.438704 1.03222
C  2.247213 1.869359 -1.085954
C  -1.005223 -0.343056 0.865128
C  3.400321 2.599017 -1.740666
C  -1.79333 -0.536499 -0.277013
C  -1.592508 0.239532 1.986669
C  -3.117466 -0.126329 -0.292005
C  3.778753 -0.213745 1.42371
C  3.358212 2.461444 -3.255811
C  2.761688 -2.038956 0.712041
C  -1.190589 -1.185459 -1.488842
C  -2.915649 0.641739 1.975905
C  -3.673491 0.461446 0.831882
C  4.637187 -1.258148 1.333849
H  1.41801 1.757485 2.074077
H  0.32404 1.782449 0.695645
H  1.28774 2.263794 -1.450389
H  2.281214 0.806564 -1.360621
H  3.368912 3.653971 -1.458133
H  4.340611 2.196427 -1.35662
H  -1.004996 0.356132 2.888246
H  -3.726598 -0.262888 -1.173768
H  3.931511 0.806536 1.72188
H  3.420725 1.417062 -3.564564
H  2.437522 2.873566 -3.671521
H  4.190463 2.989238 -3.719546
H  1.959523 -2.666234 0.359058
H  -3.354326 1.090915 2.856169
H  5.689811 -1.265352 1.566307
totalener: -1579.95643168 hartree
nucrepener: 2153.59542246 hartree
electener: -3733.55185414 hartree
oneelecener: -6448.86754488 hartree
twoeener: 2715.31569074 hartree
kineticenergy: 1574.94918204 hartree
xcener: -123.751598742564 hartree
chargesum: -0.0000000
charge: -0.066846 -0.159917 -0.171142 -0.172797 -0.326143 -0.032422 -0.288562 -0.292853 0.155391 0.002815 0.006448 0.110430 -0.080733 -0.178223 -0.159432 -0.082894 -0.117602 -0.256337 0.058571 0.549886 -0.102534 0.078153 -0.084205 0.126363 0.115151 0.083855 0.083914 0.062486 0.064455 0.136410 0.131564 0.155508 0.081574 0.074232 0.088585 0.149977 0.126800 0.130077
qa: -0.0668 -0.1599 -0.1711 -0.1728 -0.3261 -0.0324 -0.2886 -0.2929 0.1554 0.0028 0.0064 0.1104 -0.0807 -0.1782 -0.1594 -0.0829 -0.1176 -0.2563 0.0586 0.5499 -0.1025 0.0782 -0.0842 0.1264 0.1152 0.0839 0.0839 0.0625 0.0645 0.1364 0.1316 0.1555 0.0816 0.0742 0.0886 0.1500 0.1268 0.1301
va: 1.2378 1.1460 1.1338 1.1164 1.9739 3.2968 3.0025 3.1373 3.8604 3.9798 3.9081 3.9589 3.9092 3.8952 3.9931 3.9682 3.8887 3.9495 4.0301 4.4241 4.0213 3.9338 4.0464 0.9853 0.9998 0.9996 0.9912 1.0127 1.0128 1.0027 1.0250 1.0139 1.0030 1.0041 1.0055 1.0149 1.0101 1.0079
dispcorr: -0.019173363 hartree
energy: -1579.975605046906
dipole: 34.74025 -35.01864 -0.27839 19.36434 -17.69633 1.66801 -0.91804 1.43345 0.51541
magnitude: 1.76788 au
magnitude: 4.49360 debye
