program: Gaussian 09
title: 000002165
version: EM64L-G09RevD.01
frameworkgroup: C1[X(C20H22ClN3O)]
method: RPBEPBE
basis: SDD
operation: Freq
keyword: #p
keyword: freq=noraman
keyword: PBEPBE/SDD
title: #p freq=noraman PBEPBE/SDD
converged: YES YES NO NO
title: Mulliken charges:
elementType: Cl O N N N C C C C C C C C C C C C C C C C C C C C H H H H H H H H H H H H H H H H H H H H H H
charge: -0.058306 -0.435726 -0.133801 -0.518252 -0.043690 -0.477984 0.336532 -0.322548 -0.307025 -0.530484 0.492901 0.074439 -0.692040 -0.675265 -0.457709 0.343766 -0.363079 0.251510 -0.029378 -0.308937 -0.348798 -0.293546 -0.391118 -0.268113 -0.093627 0.229617 0.234489 0.189685 0.220024 0.185467 0.203407 0.322934 0.233772 0.212094 0.211770 0.229211 0.209390 0.209149 0.302777 0.236828 0.219683 0.257229 0.205855 0.287192 0.357320 0.236815 0.255571
chargesum: 0.00000
title: Mulliken charges with hydrogens summed into heavy atoms:
elementType: Cl O N N N C C C C C C C C C C C C C C C C C C C C
charge: -0.058306 -0.078406 -0.133801 -0.215475 -0.043690 -0.013878 0.336532 0.087161 0.081848 -0.207550 0.492901 0.074439 -0.034404 -0.027515 -0.220881 0.343766 -0.143396 0.251510 -0.029378 -0.051708 -0.142942 -0.006354 -0.154303 -0.012543 -0.093627
polarizability: 4.13864073e+02 -2.71764124e+01 2.60316519e+02 2.01095817e+01 2.07660549e+01 1.64904063e+02
1716.lowfreq: -5.9491 -2.9697 0.0016 0.0018 0.0024 2.9988 15.1692 19.1908 36.9749
frequency: 14.9819 19.1614 36.9614 39.7709 47.7988 67.2034 82.3072 94.9712 105.7209 124.8840 141.0845 161.6042 188.0475 197.8123 214.7867 222.7544 233.6992 242.5399 270.1974 291.0319 301.1215 306.2745 345.4526 352.0374 356.9389 370.4558 421.5491 428.9200 438.5687 439.1781 459.3024 483.5128 503.1405 507.1458 527.9267 536.9315 564.6467 585.1479 598.6023 615.4029 636.9168 653.4544 704.0408 737.0573 753.4146 756.3734 764.8597 785.6147 795.3576 800.5040 802.9638 813.5236 836.3914 838.6883 871.5049 897.1022 898.7609 907.1868 938.1034 942.4373 956.3673 963.5586 990.5747 1000.2671 1042.5577 1059.9014 1062.9738 1074.4486 1083.1885 1087.3362 1096.2270 1114.3444 1152.8457 1159.5358 1165.3077 1170.6066 1202.1824 1208.3505 1227.5224 1240.2870 1253.2850 1265.2359 1268.2773 1286.9564 1292.9954 1304.9509 1335.9288 1355.2281 1358.2567 1364.3598 1373.6205 1381.3343 1388.7959 1390.4371 1395.9846 1417.7347 1435.6391 1439.7310 1458.6979 1465.7457 1469.7948 1472.8713 1475.6946 1477.9531 1486.1685 1493.3384 1496.7679 1529.0114 1556.5817 1580.4982 1607.3189 1610.5088 1622.3897 2852.6283 2861.5951 2897.6790 2983.5080 2983.9091 3016.6105 3022.1730 3042.6540 3075.5528 3077.9566 3085.7949 3092.5769 3112.7035 3118.8815 3122.3739 3138.9407 3154.3080 3173.3007 3182.8082 3184.9021 3550.9029 3583.4148
redmass: 4.5917 4.9072 4.4265 5.8589 3.5606 4.9536 2.4365 2.1809 3.2271 4.8630 3.0554 3.9347 2.6275 1.8194 2.4281 7.6379 2.1426 3.5255 5.0821 1.9152 4.0368 2.4792 2.4074 1.3658 9.6401 3.4049 3.3108 2.8638 3.3374 3.7961 2.8498 1.9586 4.9555 2.5036 4.3436 4.1063 4.5665 5.2885 5.3234 5.8131 3.6767 6.3639 4.1005 4.9283 3.0537 3.3544 2.0563 2.5875 1.4801 1.1738 1.6837 2.5874 5.6132 1.3603 5.8477 1.7145 1.6669 1.3720 1.3517 1.5209 2.5032 1.5376 2.3115 1.6764 3.1139 2.7020 1.8785 1.9843 2.2885 1.9929 2.4625 1.8786 1.4604 1.2997 1.7592 1.6294 2.3023 2.1350 1.7247 1.4962 1.7319 2.0317 1.3292 1.2273 1.4262 2.2960 1.9776 2.2899 1.7839 1.3485 1.4653 3.7639 1.2356 1.2346 5.7408 3.7300 2.7853 2.4389 1.1989 1.0597 1.0570 1.6782 1.2843 1.0680 1.0638 1.0756 3.2277 4.0702 4.2297 5.7291 6.9999 5.4148 6.5367 1.0723 1.0718 1.0705 1.0358 1.0359 1.0860 1.0880 1.0875 1.0985 1.0977 1.1001 1.1003 1.0876 1.0904 1.0881 1.0965 1.0914 1.0952 1.0934 1.0931 1.0748 1.0660
irintensity: 0.2649 0.0834 0.8022 0.2423 0.6447 0.3350 0.2312 0.4500 0.8835 0.8321 0.1781 0.4827 2.2094 1.3868 4.8705 1.2464 1.7998 0.1624 2.4809 3.1156 4.5476 2.2954 26.5679 99.1828 11.3483 10.7992 10.6322 0.4210 5.4724 13.1450 5.6590 52.0392 3.7014 61.0044 38.4167 4.6675 6.8266 14.2869 8.2314 1.2452 10.5942 7.2717 2.9297 8.5527 2.4507 10.2303 19.8660 29.3804 22.3452 8.8646 18.2114 24.9617 68.0655 38.3300 40.6484 4.7479 26.0557 1.3658 0.3905 5.0187 3.9174 2.9161 10.9828 10.8338 11.5882 42.8921 14.6789 18.2579 51.4944 69.0425 2.8950 14.8719 153.6683 16.3595 12.5557 14.4750 31.2744 17.4180 7.1410 3.7775 91.3138 19.0422 19.9591 23.9256 3.4978 49.2304 34.9295 41.8600 15.4616 1.3674 0.3944 5.7169 14.5743 21.0287 127.5271 33.7885 34.6625 127.5009 29.2288 9.8855 6.5780 14.8918 79.2133 25.5968 14.7958 7.2672 152.2041 164.0084 298.9685 224.8383 16.7568 86.4310 8.9812 32.5748 194.6206 66.0773 29.2556 21.6828 9.6763 19.4290 9.6971 26.9460 76.6424 67.8213 34.3627 25.1586 26.5354 11.3402 13.9217 15.4447 4.1507 0.8837 10.6490 15.4438 51.5111
temp: 298.150 k
press: 1.00000 atm
elementType: 17 8 7 7 7 6 6 6 6 6 6 6 6 6 6 6 6 6 6 6 6 6 6 6 6 1 1 1 1 1 1 1 1 1 1 1 1 1 1 1 1 1 1 1 1 1 1
symmnumber: 1
zpe: 990265.6 jmol-1
zpe.correction: 0.377172 hartree
zpe.thermalcorrener: 0.401210 hartree
zpe.thermalcorrenthalpy: 0.402154 hartree
zpe.thermalcorrgfe: 0.321275 hartree
zpe.sumelectzpe: -1473.048015 hartree
zpe.sumelectthermal: -1473.023977 hartree
zpe.sumelectthermalent: -1473.023033 hartree
zpe.sumelectthermalfe: -1473.103912 hartree
dipole: -5.5859 4.3702 0.2648
dipole: 7.0973
quadrupole: -166.9485 -135.5454 -158.0896
quadrupole: 4.4443 5.6359 -1.4850
quadrupole: -13.4207 17.9824 -4.5618 4.4443 5.6359 -1.4850
hfenergy: -1473.4251869 hartree
pointgroup: C01 [X(C20H22Cl1N3O1)]
dipole: 2.1767694 -1.7397781 0.1781023 debye
polarizability: 413.0429748|-30.0634745|258.9058134|-19.7818465|-24.783958|167.1358667 unknown
InChI: InChI=1S/C20H22ClN3O/c1-3-24(4-2)13-14-11-16(6-8-20(14)25)23-18-9-10-22-19-12-15(21)5-7-17(18)19/h5-12,23,25H,3-4,13H2,1-2H3
charge 0 multiplicity 1
47 atoms
Cl -7.263783 0.309523 0.860424
O  4.937767 -2.509765 -0.005563
N  3.5884 1.511756 0.328855
N  -0.63113 -1.468959 -0.051902
N  -2.882667 1.932684 -1.398769
C  4.12389 0.141224 0.519139
C  3.108132 -0.951093 0.196807
C  3.579233 1.893362 -1.112116
C  4.26238 2.513287 1.199413
C  1.724349 -0.68469 0.188035
C  0.776335 -1.704238 -0.085265
C  3.544789 -2.280691 -0.04759
C  2.628366 3.062436 -1.431962
C  3.822742 2.41963 2.673145
C  1.233523 -3.023355 -0.332033
C  -1.332707 -0.333432 -0.458541
C  2.61315 -3.311779 -0.301866
C  -2.737644 -0.203666 -0.101018
C  -3.463803 0.939315 -0.618867
C  -0.761923 0.693679 -1.239409
C  -3.432576 -1.134003 0.735816
C  -4.857993 1.080814 -0.318136
C  -1.568176 1.781928 -1.670181
C  -4.791977 -0.981377 1.027083
C  -5.48818 0.13159 0.477804
H  4.431268 0.026201 1.576015
H  5.047993 -0.038253 -0.079999
H  4.611715 2.134483 -1.473132
H  3.24978 1.003339 -1.680484
H  5.376987 2.430036 1.129069
H  3.999749 3.517037 0.821238
H  1.419806 0.339314 0.424215
H  1.607948 2.8353 -1.075311
H  2.948589 4.00757 -0.95836
H  2.592302 3.236516 -2.523514
H  2.729468 2.549827 2.751979
H  4.082572 1.444844 3.124506
H  4.318015 3.205829 3.272991
H  -1.196246 -2.269594 0.232546
H  0.51587 -3.821016 -0.557067
H  2.958316 -4.336963 -0.488711
H  0.281179 0.645518 -1.557032
H  -2.905379 -1.975208 1.201937
H  -5.381994 1.947139 -0.729003
H  5.143822 -3.453716 -0.217199
H  -1.115441 2.56756 -2.287879
H  -5.313715 -1.691243 1.674687
