program: Orca
programVersion: 4.2.1
elementType: Cl O O N N N C C C C C C C C C C C C C C H H H H H H H H H H H H H H H H H H
charge: 0
multiplicity: 1
keywords: wb97x-d3
keywords: def2-TZVPP
keywords: def2/J RIJCOSX GRIDX6 NOFINALGRIDX
keywords: grid4 nofinalgrid
keywords: scfconv7
keywords: smallprint printgap noloewdin
keywords: NOSOSCF
formula: C14H18ClN3O2
InChI: InChI=1/C14H18ClN3O2/c1-14(2,3)12(19)13(18-9-16-8-17-18)20-11-6-4-10(15)5-7-11/h4-9,12-13,19H,1-3H3
38 atoms
Cl -5.495092 0.22774 0.198624
O  2.252247 -2.239429 -1.078924
O  0.152007 -0.698553 -1.055315
N  1.098989 1.001559 0.201706
N  1.542632 1.8734 -0.707725
N  0.677625 2.949572 1.055837
C  3.55334 -1.077374 0.535311
C  2.454332 -0.956667 -0.545324
C  1.095784 -0.41906 -0.046585
C  3.842162 0.265338 1.212022
C  3.18233 -2.107226 1.605546
C  4.838264 -1.528904 -0.169013
C  0.572397 1.65929 1.242729
C  -1.158846 -0.480841 -0.729821
C  1.27557 3.025658 -0.151889
C  -1.846982 0.531444 -1.381724
C  -1.802054 -1.272858 0.212405
C  -3.187814 0.747982 -1.102907
C  -3.13874 -1.052255 0.502779
C  -3.821949 -0.04309 -0.158468
H  2.816044 -0.264223 -1.318716
H  0.80949 -0.895513 0.896631
H  3.054121 0.577693 1.897161
H  4.752036 0.182595 1.809335
H  4.004222 1.067445 0.489755
H  3.998863 -2.207093 2.322512
H  2.998375 -3.095483 1.185602
H  2.299598 -1.819209 2.179499
H  5.155714 -0.802391 -0.920792
H  4.725322 -2.493205 -0.663308
H  5.650768 -1.623965 0.553682
H  1.732839 -2.167139 -1.885095
H  0.14394 1.160955 2.098795
H  1.52162 3.959623 -0.632592
H  -1.3404 1.14737 -2.113623
H  -1.275299 -2.074738 0.714972
H  -3.724734 1.534448 -1.615552
H  -3.63985 -1.671193 1.23449
elementType: Cl O N C H
totalener: -1319.32718741 hartree
nucrepener: 1737.96332950 hartree
electener: -3057.29051691 hartree
oneelecener: -5256.39646625 hartree
twoeener: 2199.10594934 hartree
cpcmener: -0.02537646 hartree
kineticenergy: 1314.94807843 hartree
xcener: -104.205428513370 hartree
chargesum: 0.0000000
charge: -0.097061 -0.404347 -0.346945 0.138890 -0.365632 -0.382905 0.256458 0.112747 0.029192 -0.366368 -0.364622 -0.339139 0.063629 0.213052 0.083991 -0.170512 -0.167093 -0.144841 -0.155314 0.096836 0.121594 0.147625 0.096326 0.104472 0.104095 0.100921 0.103959 0.089925 0.098012 0.097678 0.094541 0.221548 0.178289 0.163064 0.144642 0.150759 0.145927 0.146606
qa: -0.0971 -0.4043 -0.3469 0.1389 -0.3656 -0.3829 0.2565 0.1127 0.0292 -0.3664 -0.3646 -0.3391 0.0636 0.2131 0.0840 -0.1705 -0.1671 -0.1448 -0.1553 0.0968 0.1216 0.1476 0.0963 0.1045 0.1041 0.1009 0.1040 0.0899 0.0980 0.0977 0.0945 0.2215 0.1783 0.1631 0.1446 0.1508 0.1459 0.1466
va: 1.2064 2.0319 2.0089 3.2805 2.8751 3.0522 3.6543 3.9140 4.0171 3.9671 3.9398 3.9046 4.0462 3.7972 4.0144 3.9657 3.9430 3.9949 3.9881 3.8274 1.0162 0.9755 0.9998 1.0081 1.0117 1.0032 1.0187 1.0036 1.0031 1.0205 1.0058 1.0205 0.9958 0.9944 1.0113 1.0028 1.0023 1.0032
dispcorr: -0.020804896 hartree
energy: -1319.347992310540
dipole: 39.32219 -38.90569 0.41649 -9.24431 8.46439 -0.77992 5.59489 -5.26785 0.32704
magnitude: 0.94270 au
magnitude: 2.39617 debye
