program: Gaussian 09
title: 000068720
version: EM64L-G09RevD.01
frameworkgroup: C1[X(C17H18ClNO4)]
method: RPBEPBE
basis: SDD
operation: Freq
keyword: #p
keyword: freq=noraman
keyword: PBEPBE/SDD
title: #p freq=noraman PBEPBE/SDD
converged: YES YES NO NO
title: Mulliken charges:
elementType: Cl O O O O N C C C C C C C C C C C C C C C C C H H H H H H H H H H H H H H H H H H
charge: -0.056406 -0.297328 -0.251839 -0.220575 -0.438927 -0.051916 0.187110 -0.707983 -0.706112 0.236867 0.327870 -0.427022 0.213360 -0.317436 -0.368242 -0.340007 0.175157 -0.202425 -0.192276 -0.164258 -0.308106 -0.140300 -0.457493 0.236422 0.249464 0.224074 0.211081 0.231775 0.261008 0.225789 0.261260 0.304564 0.255061 0.242768 0.244006 0.263558 0.256449 0.248060 0.202815 0.221344 0.368785
chargesum: 0.00000
title: Mulliken charges with hydrogens summed into heavy atoms:
elementType: Cl O O O O N C C C C C C C C C C C C C C C C C
charge: -0.056406 -0.297328 -0.251839 -0.220575 -0.070141 -0.051916 0.187110 0.001977 -0.002249 0.236867 0.327870 0.060028 0.213360 -0.012872 -0.113181 -0.097239 0.175157 0.061134 0.064173 0.079748 -0.060045 -0.140300 -0.033333
polarizability: 2.54872253e+02 -1.75407567e+01 2.42522015e+02 6.61066178e+00 -7.02800077e+00 1.43283163e+02
1716.lowfreq: -6.6210 -5.0037 -1.5973 -0.0013 -0.0006 0.0006 9.1529 29.8116 32.0820
frequency: 8.7620 29.7621 32.0615 35.5271 46.8562 59.4527 67.7629 97.8857 119.8281 133.9199 150.1877 159.8546 195.2674 197.8372 225.2116 245.4706 248.0632 260.5526 276.0620 301.2412 306.2730 328.9521 349.8280 364.7730 377.7353 403.1787 415.6834 426.0210 444.1667 447.0146 488.2925 512.0872 533.3893 566.7619 587.8768 621.7610 632.1118 677.5770 697.4102 716.6923 719.4776 738.8717 755.7124 784.0914 826.1671 833.8752 845.2747 852.2431 882.1438 909.6179 925.4912 929.3708 938.3842 944.7847 950.4796 960.2201 977.5370 983.1814 992.6338 997.5758 1001.9736 1016.1982 1069.5449 1084.9812 1091.7462 1103.9158 1139.5669 1157.7290 1172.1019 1174.7948 1191.9211 1208.5569 1222.0901 1236.9430 1239.5578 1273.0849 1289.1954 1320.0746 1326.7234 1357.4761 1358.3942 1376.2073 1379.7688 1391.1323 1396.8887 1406.8797 1451.2875 1452.2897 1455.6087 1457.9434 1466.9632 1468.7973 1468.9907 1479.1587 1570.7676 1581.0113 1585.2508 1588.0421 1622.3252 2988.0981 3000.9850 3004.4524 3023.8430 3089.4940 3095.1947 3098.6041 3107.2706 3109.6161 3124.9600 3136.9084 3140.2237 3154.5049 3156.1813 3161.2602 3170.7964 3176.6046 3524.3003
redmass: 5.3673 5.8511 6.3185 5.8374 5.7341 5.8396 6.1341 4.6295 6.0782 5.2108 5.2439 4.4039 1.1540 3.7059 2.3998 3.3844 1.5016 2.5022 4.3567 3.6596 4.8648 4.1680 3.7430 3.6882 2.1503 2.5283 2.7271 1.8599 4.3198 4.2157 5.0283 3.8037 4.6436 3.7994 5.4297 7.1050 5.1552 6.2599 5.5533 5.5316 5.1439 4.0175 1.5806 4.4532 1.3628 2.9010 2.7585 1.8852 4.5930 1.8550 1.9392 1.8512 2.6800 2.2963 1.3681 4.2366 1.3434 2.7366 3.7442 1.3773 1.3429 2.2394 2.5427 2.0993 2.3130 1.3522 2.2849 1.1167 1.1631 1.2910 2.7698 1.3297 3.6699 1.7546 3.1399 2.7343 1.2677 3.0570 1.3304 4.6699 1.7208 1.2280 1.2207 3.4538 1.2137 2.8530 2.5624 1.0692 1.0638 1.1061 1.0718 1.1011 2.1148 1.0680 7.0845 7.1776 5.6357 6.6409 10.7187 1.0653 1.0355 1.0358 1.0568 1.0990 1.1077 1.1002 1.0995 1.1007 1.1005 1.0913 1.0876 1.0932 1.0885 1.0952 1.1006 1.0975 1.0666
irintensity: 0.8688 1.0245 0.4085 0.4131 0.2436 0.3220 2.6354 0.5792 1.6858 1.6215 1.7298 0.6468 0.2550 2.7664 1.5249 0.0469 2.5940 2.3955 5.9783 1.1849 3.3295 7.3768 7.2817 22.9702 29.6047 73.6097 3.1099 47.3985 2.1256 3.8520 2.9627 22.6988 6.0596 9.0697 12.2935 0.4290 31.2391 6.9675 18.6693 4.1651 2.9725 13.1454 41.6153 18.3430 12.2302 23.6622 27.6646 57.5536 24.9219 1.7375 31.3533 14.7985 23.5893 29.8020 2.7881 14.6814 4.9104 2.3617 38.4663 0.4448 9.9078 5.8039 77.2797 177.6183 163.6320 11.8747 181.6855 12.2390 3.8502 44.4934 50.9906 1.1539 18.8215 0.9487 8.6914 2.1354 2.3246 7.0327 2.8050 1.7869 4.1359 10.5393 25.2822 4.6560 34.6619 1.8439 21.6648 5.7635 1.3815 6.7276 21.1051 19.7971 138.1582 28.0969 20.6757 3.0542 30.0516 6.0772 169.2160 48.8023 9.8378 17.6365 31.9269 26.8741 11.4568 5.8376 29.3543 16.6987 13.4546 22.8500 3.9196 12.1396 3.1157 1.6159 15.3954 4.3404 76.8850
temp: 298.150 k
press: 1.00000 atm
elementType: 17 8 8 8 8 7 6 6 6 6 6 6 6 6 6 6 6 6 6 6 6 6 6 1 1 1 1 1 1 1 1 1 1 1 1 1 1 1 1 1 1
symmnumber: 1
zpe: 828028.0 jmol-1
zpe.correction: 0.315379 hartree
zpe.thermalcorrener: 0.338135 hartree
zpe.thermalcorrenthalpy: 0.339079 hartree
zpe.thermalcorrgfe: 0.260266 hartree
zpe.sumelectzpe: -1472.605006 hartree
zpe.sumelectthermal: -1472.582251 hartree
zpe.sumelectthermalent: -1472.581307 hartree
zpe.sumelectthermalfe: -1472.660120 hartree
dipole: -4.4976 2.1101 -0.5299
dipole: 4.9962
quadrupole: -119.5133 -135.8453 -149.9790
quadrupole: 12.8164 -1.9721 -7.5090
quadrupole: 15.5993 -0.7328 -14.8665 12.8164 -1.9721 -7.5090
hfenergy: -1472.9203855 hartree
pointgroup: C01 [X(C17H18Cl1N1O4)]
dipole: 1.2355646 1.5287338 -0.0113322 debye
polarizability: 238.1734778|15.9765394|259.3348436|-7.7196796|0.2778292|143.1691093 unknown
InChI: InChI=1S/C17H18ClNO4/c1-17(2,23-15-8-6-12(18)7-9-15)16(21)22-11-14-5-3-4-13(10-20)19-14/h3-9,20H,10-11H2,1-2H3
charge 0 multiplicity 1
41 atoms
Cl -3.049484 -4.39441 0.012564
O  -1.509779 1.304001 1.304582
O  0.729819 2.267032 -0.250637
O  -0.774809 2.220478 -2.034694
O  1.621688 -2.940582 0.921274
N  2.267625 -0.261643 -0.735029
C  -1.634994 2.41496 0.296907
C  -3.031073 2.409455 -0.34458
C  -1.369582 3.677407 1.135897
C  -0.548657 2.279768 -0.805432
C  -1.864675 -0.014457 0.923614
C  1.879979 2.105087 -1.19629
C  2.774777 1.007589 -0.672276
C  -1.112103 -0.764145 -0.014872
C  -2.956163 -0.607317 1.601058
C  4.065832 1.283572 -0.164377
C  3.03171 -1.298667 -0.274806
C  -1.479281 -2.101731 -0.292446
C  -3.317132 -1.94663 1.335546
C  4.8590 0.210068 0.300179
C  4.334859 -1.098015 0.248884
C  -2.578065 -2.671574 0.380661
C  2.385686 -2.67265 -0.309462
H  -3.141239 3.27168 -1.023379
H  -3.200721 1.495906 -0.937685
H  -3.796659 2.475901 0.447294
H  -1.377247 4.57865 0.497498
H  -2.158153 3.77658 1.900757
H  -0.391621 3.598233 1.635395
H  2.400646 3.076714 -1.22374
H  1.473017 1.861003 -2.193495
H  -0.228441 -0.339877 -0.504326
H  -3.509261 -0.014355 2.335705
H  4.435092 2.313465 -0.128575
H  5.862352 0.393098 0.69816
H  -0.9188 -2.687852 -1.027545
H  -4.158854 -2.411446 1.856958
H  4.912039 -1.954311 0.611017
H  1.740561 -2.749911 -1.207341
H  3.148656 -3.467155 -0.336378
H  0.824955 -2.347717 0.943217
