program: Orca
programVersion: 4.2.1
elementType: Cl O O N N N C C C C C C C C C C C C C C H H H H H H H H H H H H H H H H H H
charge: 0
multiplicity: 1
keywords: wb97x-d3
keywords: def2-TZVPP
keywords: def2/J RIJCOSX GRIDX6 NOFINALGRIDX
keywords: grid4 nofinalgrid
keywords: scfconv7
keywords: smallprint printgap noloewdin
keywords: NOSOSCF
formula: C14H18ClN3O2
InChI: InChI=1/C14H18ClN3O2/c1-14(2,3)12(19)13(18-9-16-8-17-18)20-11-6-4-10(15)5-7-11/h4-9,12-13,19H,1-3H3
38 atoms
Cl -5.384468 -0.827266 0.325966
O  3.446153 0.78295 0.73813
O  0.407294 -0.538123 -0.50477
N  1.097203 1.661887 -0.252478
N  1.135698 1.963143 -1.551248
N  0.963445 3.822346 -0.314187
C  3.042231 -1.614358 0.394197
C  2.716966 -0.155047 -0.0199
C  1.265533 0.294617 0.200484
C  2.531577 -2.616687 -0.645999
C  4.570157 -1.750175 0.441881
C  2.47176 -1.952184 1.771514
C  1.003339 2.778044 0.474686
C  -0.927226 -0.532154 -0.25549
C  1.041563 3.266729 -1.540824
C  -1.687281 -1.369935 -1.068185
C  -1.549687 0.21737 0.735195
C  -3.054669 -1.464206 -0.89165
C  -2.924719 0.123297 0.910392
C  -3.670026 -0.713245 0.100595
H  2.945069 -0.049476 -1.090074
H  1.051287 0.296443 1.275588
H  2.917884 -3.612952 -0.419506
H  1.446349 -2.695199 -0.674164
H  2.874804 -2.359884 -1.652191
H  5.020436 -1.164447 1.244398
H  5.036126 -1.449156 -0.501278
H  4.846747 -2.792135 0.614809
H  1.380619 -2.008553 1.768599
H  2.770947 -1.224127 2.528784
H  2.832568 -2.928144 2.103088
H  4.318484 0.891209 0.347457
H  0.968519 2.778975 1.553058
H  1.031983 3.843127 -2.453011
H  -1.203488 -1.953511 -1.84166
H  -1.005094 0.880447 1.392426
H  -3.63193 -2.122031 -1.527263
H  -3.399788 0.711413 1.684216
elementType: Cl O N C H
totalener: -1319.32791876 hartree
nucrepener: 1728.04526473 hartree
electener: -3047.37318348 hartree
oneelecener: -5236.73405219 hartree
twoeener: 2189.36086870 hartree
cpcmener: -0.02836596 hartree
kineticenergy: 1314.93292909 hartree
xcener: -104.204455789311 hartree
chargesum: 0.0000000
charge: -0.102942 -0.397819 -0.300802 0.132183 -0.365492 -0.406455 0.239861 0.033483 0.132955 -0.330538 -0.352809 -0.371735 0.067758 0.353822 0.073414 -0.276930 -0.199350 -0.106785 -0.183042 0.073612 0.115614 0.151759 0.095614 0.097850 0.095774 0.097584 0.105568 0.092965 0.091237 0.103993 0.102073 0.227384 0.179745 0.163078 0.144516 0.134015 0.144361 0.144481
qa: -0.1029 -0.3978 -0.3008 0.1322 -0.3655 -0.4065 0.2399 0.0335 0.1330 -0.3305 -0.3528 -0.3717 0.0678 0.3538 0.0734 -0.2769 -0.1994 -0.1068 -0.1830 0.0736 0.1156 0.1518 0.0956 0.0979 0.0958 0.0976 0.1056 0.0930 0.0912 0.1040 0.1021 0.2274 0.1797 0.1631 0.1445 0.1340 0.1444 0.1445
va: 1.2007 2.0269 2.0986 3.3091 2.8858 3.0381 3.6582 4.0030 3.9014 3.9406 3.9305 3.9388 4.0766 3.6549 4.0379 4.0441 3.9552 3.9677 4.0492 3.8310 1.0099 0.9757 1.0038 1.0070 1.0060 1.0132 1.0006 1.0074 1.0021 1.0142 1.0058 1.0078 0.9923 0.9935 1.0074 1.0154 1.0030 1.0054
dispcorr: -0.020081495 hartree
energy: -1319.348000251637
dipole: 35.42636 -33.92866 1.49770 -12.76808 11.55678 -1.21130 3.78064 -3.12971 0.65093
magnitude: 2.03324 au
magnitude: 5.16809 debye
