program: Orca
programVersion: 4.2.1
elementType: Cl O O N N N C C C C C C C C C C C C C C H H H H H H H H H H H H H H H H
charge: 0
multiplicity: 1
keywords: wb97x-d3
keywords: def2-TZVPP
keywords: def2/J RIJCOSX GRIDX6 NOFINALGRIDX
keywords: grid4 nofinalgrid
keywords: scfconv7
keywords: smallprint printgap noloewdin
keywords: NOSOSCF
formula: C14H16ClN3O2
InChI: InChI=1/C14H16ClN3O2/c1-14(2,3)12(19)13(18-9-16-8-17-18)20-11-6-4-10(15)5-7-11/h4-9,13H,1-3H3
36 atoms
Cl 5.544132 -0.093438 0.254633
O  -0.204764 -0.649151 -0.736716
O  -2.786245 -0.561174 -1.572758
N  -1.262872 1.303756 0.01958
N  -1.329792 2.059108 1.123237
N  -1.361388 3.340226 -0.716802
C  -3.332287 -1.579597 0.53708
C  -2.500682 -0.764334 -0.420794
C  -1.188768 -0.137352 0.106659
C  -2.470579 -2.711352 1.112582
C  -3.799583 -0.64808 1.665422
C  -4.539587 -2.165649 -0.185103
C  1.116051 -0.473035 -0.429535
C  -1.281063 2.081794 -1.068945
C  1.584713 0.216361 0.679942
C  2.011467 -1.047444 -1.325659
C  -1.392185 3.266151 0.629394
C  2.953795 0.329372 0.887856
C  3.372894 -0.934697 -1.116308
C  3.838286 -0.242736 -0.007235
H  -1.006275 -0.372905 1.157246
H  -3.085344 -3.326016 1.770366
H  -2.07611 -3.356935 0.327599
H  -1.632759 -2.351103 1.710046
H  -4.415293 -1.216949 2.362861
H  -4.40361 0.174988 1.281858
H  -2.975219 -0.22484 2.240416
H  -4.244034 -2.840433 -0.988984
H  -5.178212 -1.391036 -0.609233
H  -5.142428 -2.738801 0.519844
H  -1.22297 1.707312 -2.077319
H  0.92604 0.679553 1.400856
H  1.640821 -1.585579 -2.187913
H  -1.457286 4.132857 1.26715
H  3.313516 0.869897 1.752101
H  4.061654 -1.38537 -1.816971
elementType: Cl O N C H
totalener: -1318.10333243 hartree
nucrepener: 1680.09363203 hartree
electener: -2998.19696446 hartree
oneelecener: -5138.69219946 hartree
twoeener: 2140.49523500 hartree
cpcmener: -0.02783070 hartree
kineticenergy: 1313.82814701 hartree
xcener: -103.772215811522 hartree
chargesum: 0.0000000
charge: -0.102302 -0.297126 -0.386801 0.112444 -0.346008 -0.407066 0.207319 0.219166 0.068304 -0.316844 -0.314441 -0.314726 0.326808 0.087717 -0.182888 -0.278410 0.089052 -0.189300 -0.106706 0.077497 0.169387 0.103318 0.118459 0.099476 0.105801 0.119284 0.095488 0.105185 0.101979 0.102889 0.179038 0.140227 0.149642 0.167576 0.148394 0.148169
qa: -0.1023 -0.2971 -0.3868 0.1124 -0.3460 -0.4071 0.2073 0.2192 0.0683 -0.3168 -0.3144 -0.3147 0.3268 0.0877 -0.1829 -0.2784 0.0891 -0.1893 -0.1067 0.0775 0.1694 0.1033 0.1185 0.0995 0.1058 0.1193 0.0955 0.1052 0.1020 0.1029 0.1790 0.1402 0.1496 0.1676 0.1484 0.1482
va: 1.2011 2.0840 2.0958 3.3093 2.8626 3.0449 3.7055 3.9565 3.9738 3.9409 3.9269 3.9329 3.6903 4.0569 3.9067 4.0447 4.0168 4.0488 3.9601 3.8302 0.9773 1.0019 1.0022 1.0090 1.0042 1.0023 1.0151 1.0052 1.0069 1.0063 1.0075 1.0251 1.0078 0.9918 1.0051 1.0014
dispcorr: -0.018315840 hartree
energy: -1318.121648269412
dipole: -32.67727 31.94934 -0.72793 -12.26807 10.65950 -1.60856 7.28089 -5.94116 1.33973
magnitude: 2.21635 au
magnitude: 5.63353 debye
