program: Orca
programVersion: 4.2.1
elementType: Cl O O N N N C C C C C C C C C C C C C C H H H H H H H H H H H H H H H H
charge: 0
multiplicity: 1
keywords: wb97x-d3
keywords: def2-TZVPP
keywords: def2/J RIJCOSX GRIDX6 NOFINALGRIDX
keywords: grid4 nofinalgrid
keywords: scfconv7
keywords: smallprint printgap noloewdin
keywords: NOSOSCF
formula: C14H16ClN3O2
InChI: InChI=1/C14H16ClN3O2/c1-14(2,3)12(19)13(18-9-16-8-17-18)20-11-6-4-10(15)5-7-11/h4-9,13H,1-3H3
36 atoms
Cl 5.678883 0.054274 0.126556
O  -0.048874 -0.697689 -0.834811
O  -2.350586 -1.474026 -1.571834
N  -1.252358 1.022986 0.190564
N  -1.206753 1.657423 1.366861
N  -1.616097 3.101862 -0.292301
C  -3.547855 -1.16276 0.47854
C  -2.334395 -1.074426 -0.438549
C  -1.041631 -0.407061 0.084933
C  -4.328854 -2.429739 0.119408
C  -3.170925 -1.204627 1.960088
C  -4.432615 0.065873 0.205181
C  1.259957 -0.482414 -0.526985
C  -1.497059 1.900126 -0.794065
C  2.164281 -0.859804 -1.515599
C  1.719461 0.065481 0.663182
C  -1.4338 2.89959 1.029962
C  3.521773 -0.697439 -1.317741
C  3.08566 0.225815 0.86072
C  3.977572 -0.15347 -0.124889
H  -0.804518 -0.767471 1.089809
H  -4.685871 -2.418929 -0.909817
H  -3.72607 -3.32884 0.258848
H  -5.200673 -2.51486 0.769371
H  -2.510178 -2.041951 2.193135
H  -4.075855 -1.333428 2.555474
H  -2.696213 -0.28634 2.307603
H  -3.967547 1.000498 0.52099
H  -5.363772 -0.031226 0.766246
H  -4.691023 0.151448 -0.851241
H  -1.573637 1.624694 -1.834679
H  1.797876 -1.285245 -2.441108
H  1.052509 0.384268 1.452516
H  -1.466127 3.691872 1.76121
H  4.216312 -0.995326 -2.091318
H  3.439478 0.653336 1.78892
elementType: Cl O N C H
totalener: -1318.11012405 hartree
nucrepener: 1683.37395860 hartree
electener: -3001.48408265 hartree
oneelecener: -5145.19204831 hartree
twoeener: 2143.70796566 hartree
cpcmener: -0.02466282 hartree
kineticenergy: 1313.80335613 hartree
xcener: -103.768714863187 hartree
chargesum: 0.0000000
charge: -0.101474 -0.288469 -0.352413 0.107446 -0.348508 -0.380307 0.201549 0.174150 0.115438 -0.307594 -0.341961 -0.329414 0.335449 0.058282 -0.282254 -0.185031 0.100071 -0.107140 -0.196122 0.081108 0.170152 0.099753 0.108110 0.100025 0.111139 0.103737 0.103009 0.100840 0.107830 0.118923 0.184615 0.146138 0.139514 0.164145 0.144860 0.144403
qa: -0.1015 -0.2885 -0.3524 0.1074 -0.3485 -0.3803 0.2015 0.1742 0.1154 -0.3076 -0.3420 -0.3294 0.3354 0.0583 -0.2823 -0.1850 0.1001 -0.1071 -0.1961 0.0811 0.1702 0.0998 0.1081 0.1000 0.1111 0.1037 0.1030 0.1008 0.1078 0.1189 0.1846 0.1461 0.1395 0.1641 0.1449 0.1444
va: 1.2024 2.1034 2.1194 3.2626 2.8389 3.0448 3.7163 4.1088 3.8709 3.9177 3.9250 3.9392 3.7123 4.0723 4.0337 3.8905 3.9925 3.9641 4.0620 3.8371 0.9831 1.0156 1.0028 1.0053 1.0016 1.0064 1.0193 1.0043 1.0043 1.0046 0.9988 1.0097 1.0286 0.9932 1.0028 1.0068
dispcorr: -0.018890844 hartree
energy: -1318.129014893322
dipole: -36.18627 35.09562 -1.09065 -7.14441 6.42972 -0.71468 6.71587 -5.63345 1.08242
magnitude: 1.69468 au
magnitude: 4.30752 debye
