program: Orca
programVersion: 4.2.1
elementType: Cl Cl F F F F O N N N C C C C C C C C C C C C C H H H H H H H H H H H
charge: 0
multiplicity: 1
keywords: wb97x-d3
keywords: def2-TZVPP
keywords: def2/J RIJCOSX GRIDX6 NOFINALGRIDX
keywords: grid4 nofinalgrid
keywords: scfconv7
keywords: smallprint printgap noloewdin
keywords: NOSOSCF
formula: C13H11Cl2F4N3O
InChI: InChI=1/C13H11Cl2F4N3O/c14-9-1-2-10(11(15)3-9)8(4-22-7-20-6-21-22)5-23-13(18,19)12(16)17/h1-3,6-8,12H,4-5H2
34 atoms
Cl -1.658661 0.82726 -3.06399
Cl -2.88124 3.499498 1.398838
F  2.734522 -0.357399 1.511262
F  4.033743 -1.239931 0.03353
F  4.856384 1.189485 0.932437
F  2.979377 2.096868 0.282295
O  2.11795 -0.305178 -0.637526
N  -1.510928 -2.713499 -0.154168
N  -0.81797 -3.487154 0.688036
N  -2.734119 -2.812278 1.640922
C  -0.020915 -1.080227 -1.296293
C  -0.968109 -2.282034 -1.419607
C  1.289637 -1.476633 -0.636287
C  -0.713607 0.079744 -0.625542
C  -1.487223 0.988342 -1.345337
C  -0.664307 0.259147 0.755111
C  3.137628 -0.237487 0.220607
C  -2.157176 2.041395 -0.741395
C  -1.324354 1.295476 1.391556
C  -2.636359 -2.309102 0.434226
C  -2.061367 2.186165 0.630772
C  3.853926 1.098237 0.029916
C  -1.593049 -3.517235 1.741705
H  0.221054 -0.805539 -2.325661
H  -1.805579 -2.024295 -2.065948
H  -0.455602 -3.124131 -1.882507
H  1.150887 -1.860019 0.374595
H  1.763144 -2.262796 -1.227297
H  -0.099705 -0.426577 1.372514
H  -2.741358 2.73184 -1.333424
H  -1.259035 1.401869 2.464993
H  -3.358083 -1.672836 -0.053511
H  4.256418 1.207348 -0.977009
H  -1.325246 -4.083433 2.619835
elementType: Cl F O N C H
totalener: -2061.43291047 hartree
nucrepener: 2379.24347966 hartree
electener: -4440.67639014 hartree
oneelecener: -7570.36315247 hartree
twoeener: 3129.68676233 hartree
cpcmener: -0.03053136 hartree
kineticenergy: 2055.87813672 hartree
xcener: -143.924603851405 hartree
chargesum: -0.0000000
charge: -0.080915 -0.085718 -0.201461 -0.200788 -0.201277 -0.199376 -0.298108 0.127470 -0.372999 -0.407789 0.109036 -0.114341 -0.089051 0.028609 -0.010938 -0.183237 0.467064 -0.125508 -0.147926 0.051934 0.091154 0.283277 0.080106 0.086880 0.135546 0.131332 0.117947 0.139544 0.137596 0.124892 0.147677 0.173165 0.123516 0.162688
qa: -0.0809 -0.0857 -0.2015 -0.2008 -0.2013 -0.1994 -0.2981 0.1275 -0.3730 -0.4078 0.1090 -0.1143 -0.0891 0.0286 -0.0109 -0.1832 0.4671 -0.1255 -0.1479 0.0519 0.0912 0.2833 0.0801 0.0869 0.1355 0.1313 0.1179 0.1395 0.1376 0.1249 0.1477 0.1732 0.1235 0.1627
va: 1.2489 1.2176 1.0941 1.0985 1.0846 1.0838 2.0755 3.3308 2.8659 3.0184 3.7727 3.8972 3.9192 3.4256 3.9755 3.8755 4.3016 4.0637 4.0647 4.0724 3.8694 4.1326 4.0276 1.0390 1.0056 1.0117 1.0215 1.0050 1.0107 1.0200 1.0038 0.9927 0.9842 0.9951
dispcorr: -0.019813888 hartree
energy: -2061.452724358132
dipole: -10.98466 10.99322 0.00856 -17.75378 17.21573 -0.53805 -3.16791 0.96223 -2.20568
magnitude: 2.27037 au
magnitude: 5.77083 debye
