program: Orca
programVersion: 4.2.1
elementType: Cl Cl F F F F O N N N C C C C C C C C C C C C C H H H H H H H H H H H
charge: 0
multiplicity: 1
keywords: wb97x-d3
keywords: def2-TZVPP
keywords: def2/J RIJCOSX GRIDX6 NOFINALGRIDX
keywords: grid4 nofinalgrid
keywords: scfconv7
keywords: smallprint printgap noloewdin
keywords: NOSOSCF
formula: C13H11Cl2F4N3O
InChI: InChI=1/C13H11Cl2F4N3O/c14-9-1-2-10(11(15)3-9)8(4-22-7-20-6-21-22)5-23-13(18,19)12(16)17/h1-3,6-8,12H,4-5H2
34 atoms
Cl -1.091423 0.722784 -2.873839
Cl -3.328956 3.350676 1.206358
F  4.232123 -1.124022 0.044923
F  3.158739 -0.058379 -1.494396
F  4.193367 1.124098 1.642936
F  3.111979 2.199625 0.077699
O  2.194944 -0.335911 0.507069
N  -1.552798 -2.614232 -0.037632
N  -1.164819 -3.229409 1.083534
N  -3.306197 -2.577347 1.247736
C  0.257535 -1.075378 -0.781898
C  -0.631391 -2.290519 -1.099321
C  1.39166 -1.472944 0.154025
C  -0.588006 0.068758 -0.282283
C  -1.265163 0.914922 -1.158614
C  -0.806859 0.274407 1.078053
C  3.334436 -0.12086 -0.147877
C  -2.106679 1.925982 -0.719928
C  -1.642351 1.271337 1.550862
C  -2.820062 -2.218756 0.084539
C  -2.284176 2.093902 0.641358
C  3.976788 1.187511 0.309635
C  -2.248406 -3.184465 1.81579
H  0.705666 -0.799365 -1.737502
H  -1.224635 -2.086301 -1.988968
H  -0.021933 -3.166669 -1.318887
H  1.031806 -1.881773 1.095735
H  1.987146 -2.255832 -0.319624
H  -0.321746 -0.359577 1.80806
H  -2.613711 2.565051 -1.42918
H  -1.785865 1.399649 2.614309
H  -3.34957 -1.696433 -0.697411
H  4.918067 1.383333 -0.204556
H  -2.278426 -3.619118 2.802838
elementType: Cl F O N C H
totalener: -2061.43112453 hartree
nucrepener: 2386.65756498 hartree
electener: -4448.08868951 hartree
oneelecener: -7585.46250141 hartree
twoeener: 3137.37381189 hartree
cpcmener: -0.03035054 hartree
kineticenergy: 2055.86897770 hartree
xcener: -143.922607088487 hartree
chargesum: 0.0000000
charge: -0.080395 -0.086317 -0.201261 -0.204313 -0.200657 -0.199344 -0.301395 0.139629 -0.374433 -0.404290 0.071617 -0.135459 -0.035515 0.032320 -0.019842 -0.167368 0.449863 -0.114416 -0.163403 0.057756 0.095552 0.284098 0.074798 0.082697 0.138302 0.133753 0.123529 0.130382 0.142141 0.125400 0.147152 0.169487 0.127544 0.162388
qa: -0.0804 -0.0863 -0.2013 -0.2043 -0.2007 -0.1993 -0.3014 0.1396 -0.3744 -0.4043 0.0716 -0.1355 -0.0355 0.0323 -0.0198 -0.1674 0.4499 -0.1144 -0.1634 0.0578 0.0956 0.2841 0.0748 0.0827 0.1383 0.1338 0.1235 0.1304 0.1421 0.1254 0.1472 0.1695 0.1275 0.1624
va: 1.2492 1.2166 1.0975 1.0933 1.0849 1.0876 2.0872 3.3061 2.8543 3.0199 3.7710 3.9132 3.8673 3.4450 3.9701 3.9061 4.3482 4.0529 4.0754 4.0669 3.8620 4.1355 4.0300 1.0518 1.0028 1.0090 1.0247 1.0087 1.0026 1.0198 1.0042 0.9948 0.9821 0.9951
dispcorr: -0.020016754 hartree
energy: -2061.451141285349
dipole: -10.50797 11.32806 0.82009 -17.57849 16.90434 -0.67416 2.54793 -3.92592 -1.37799
magnitude: 1.73951 au
magnitude: 4.42149 debye
