program: Orca
programVersion: 4.2.1
elementType: Cl Cl F F F F O N N N C C C C C C C C C C C C C H H H H H H H H H H H
charge: 0
multiplicity: 1
keywords: wb97x-d3
keywords: def2-TZVPP
keywords: def2/J RIJCOSX GRIDX6 NOFINALGRIDX
keywords: grid4 nofinalgrid
keywords: scfconv7
keywords: smallprint printgap noloewdin
keywords: NOSOSCF
formula: C13H11Cl2F4N3O
InChI: InChI=1/C13H11Cl2F4N3O/c14-9-1-2-10(11(15)3-9)8(4-22-7-20-6-21-22)5-23-13(18,19)12(16)17/h1-3,6-8,12H,4-5H2
34 atoms
Cl -1.548733 -0.103776 -2.307117
Cl -2.933226 3.368591 1.505043
F  3.339531 0.622231 1.25973
F  4.371013 -0.70756 -0.089856
F  4.95137 1.882018 -0.522875
F  2.837999 2.369425 -0.780085
O  2.207048 -0.27746 -0.443128
N  -1.805683 -2.87803 0.213529
N  -2.751949 -2.521387 1.085621
N  -3.671898 -3.099533 -0.877979
C  0.207134 -1.508661 -0.144303
C  -0.39824 -2.751987 0.514823
C  1.674674 -1.421093 0.235785
C  -0.564108 -0.268129 0.229953
C  -1.387206 0.414884 -0.659441
C  -0.51032 0.215416 1.534932
C  3.377514 0.216135 -0.034436
C  -2.118309 1.533202 -0.283299
C  -1.225604 1.325083 1.944795
C  -2.367422 -3.203571 -0.950064
C  -2.026627 1.977664 1.022129
C  3.758984 1.392426 -0.931456
C  -3.846055 -2.674555 0.386647
H  0.165356 -1.656874 -1.224608
H  0.116221 -3.647639 0.167437
H  -0.300814 -2.716614 1.5985
H  1.800835 -1.334672 1.316939
H  2.193507 -2.323635 -0.09346
H  0.102921 -0.293222 2.268309
H  -2.746416 2.043894 -0.999677
H  -1.158735 1.670704 2.96662
H  -1.798382 -3.527904 -1.806753
H  3.821386 1.105083 -1.980934
H  -4.81737 -2.477823 0.812453
elementType: Cl F O N C H
totalener: -2061.43255552 hartree
nucrepener: 2368.45646958 hartree
electener: -4429.88902509 hartree
oneelecener: -7549.06225494 hartree
twoeener: 3119.17322984 hartree
cpcmener: -0.03783464 hartree
kineticenergy: 2055.89041484 hartree
xcener: -143.924494610100 hartree
chargesum: 0.0000000
charge: -0.085349 -0.088230 -0.201047 -0.201535 -0.201318 -0.199300 -0.287367 0.113254 -0.340168 -0.406702 0.091317 -0.105233 -0.084409 0.051172 -0.017670 -0.186370 0.455002 -0.119176 -0.155332 0.036995 0.093804 0.285016 0.053199 0.085723 0.139971 0.126220 0.127319 0.134573 0.141412 0.124971 0.148407 0.184253 0.123795 0.162805
qa: -0.0853 -0.0882 -0.2010 -0.2015 -0.2013 -0.1993 -0.2874 0.1133 -0.3402 -0.4067 0.0913 -0.1052 -0.0844 0.0512 -0.0177 -0.1864 0.4550 -0.1192 -0.1553 0.0370 0.0938 0.2850 0.0532 0.0857 0.1400 0.1262 0.1273 0.1346 0.1414 0.1250 0.1484 0.1843 0.1238 0.1628
va: 1.2361 1.2151 1.0956 1.0965 1.0844 1.0840 2.0752 3.3695 2.8833 3.0180 3.7873 3.8956 3.9553 3.4018 3.9593 3.9642 4.3274 4.0494 4.0308 4.0576 3.8589 4.1269 4.0529 1.0453 1.0018 1.0075 0.9969 1.0047 1.0051 1.0194 1.0030 0.9914 0.9844 0.9958
dispcorr: -0.019303131 hartree
energy: -2061.451858646841
dipole: -10.68772 12.26753 1.57982 -20.64944 18.92490 -1.72455 3.97684 -4.14122 -0.16438
magnitude: 2.34455 au
magnitude: 5.95937 debye
