program: Orca
programVersion: 4.2.1
elementType: Cl Cl F F F F O N N N C C C C C C C C C C C C C H H H H H H H H H H H
charge: 0
multiplicity: 1
keywords: wb97x-d3
keywords: def2-TZVPP
keywords: def2/J RIJCOSX GRIDX6 NOFINALGRIDX
keywords: grid4 nofinalgrid
keywords: scfconv7
keywords: smallprint printgap noloewdin
keywords: NOSOSCF
formula: C13H11Cl2F4N3O
InChI: InChI=1/C13H11Cl2F4N3O/c14-9-1-2-10(11(15)3-9)8(4-22-7-20-6-21-22)5-23-13(18,19)12(16)17/h1-3,6-8,12H,4-5H2
34 atoms
Cl -0.622709 0.639792 -2.499528
Cl -4.890531 2.895688 -0.210747
F  2.942956 -0.084143 -1.371834
F  3.963662 1.501392 -0.323352
F  4.222793 -1.960081 0.170964
F  5.262097 -0.365186 1.243444
O  2.621454 0.145746 0.830566
N  -0.92348 -2.22096 1.101395
N  -0.987516 -2.936051 -0.022744
N  -2.850253 -3.220714 1.196378
C  0.254136 -0.203396 0.335291
C  0.179523 -1.329152 1.368159
C  1.348648 0.797421 0.696946
C  -1.039619 0.557439 0.187759
C  -1.51532 0.977772 -1.053068
C  -1.792262 0.916093 1.303742
C  3.495649 0.235531 -0.174599
C  -2.695623 1.691928 -1.191491
C  -2.972344 1.631914 1.201596
C  -2.039953 -2.390039 1.807104
C  -3.416738 2.008076 -0.054066
C  4.683247 -0.693297 0.067404
C  -2.154659 -3.51691 0.08449
H  0.500238 -0.660929 -0.623267
H  1.103945 -1.904523 1.355961
H  0.055438 -0.950067 2.381848
H  1.384528 1.603337 -0.038515
H  1.145938 1.252036 1.666984
H  -1.452918 0.63995 2.293809
H  -3.041118 1.996102 -2.169506
H  -3.532361 1.888995 2.089294
H  -2.212319 -1.911124 2.75792
H  5.419669 -0.63372 -0.734752
H  -2.519546 -4.190051 -0.675279
elementType: Cl F O N C H
totalener: -2061.43239136 hartree
nucrepener: 2337.75401264 hartree
electener: -4399.18640400 hartree
oneelecener: -7487.49453981 hartree
twoeener: 3088.30813581 hartree
cpcmener: -0.03476335 hartree
kineticenergy: 2055.88493599 hartree
xcener: -143.923689894880 hartree
chargesum: -0.0000000
charge: -0.077670 -0.085297 -0.199092 -0.199483 -0.200528 -0.199467 -0.314645 0.114749 -0.351885 -0.419750 0.074364 -0.126122 -0.004020 0.044440 -0.005533 -0.236600 0.454521 -0.130984 -0.152482 0.076290 0.094946 0.282330 0.064721 0.080020 0.123358 0.128498 0.124535 0.135994 0.160152 0.124290 0.148797 0.177920 0.130839 0.162793
qa: -0.0777 -0.0853 -0.1991 -0.1995 -0.2005 -0.1995 -0.3146 0.1147 -0.3519 -0.4197 0.0744 -0.1261 -0.0040 0.0444 -0.0055 -0.2366 0.4545 -0.1310 -0.1525 0.0763 0.0949 0.2823 0.0647 0.0800 0.1234 0.1285 0.1245 0.1360 0.1602 0.1243 0.1488 0.1779 0.1308 0.1628
va: 1.2507 1.2182 1.0983 1.1005 1.0882 1.0866 2.0766 3.3720 2.8786 3.0251 3.6877 3.8872 3.8602 3.4637 4.0056 3.9801 4.3349 4.0491 4.0508 4.0431 3.8664 4.1336 4.0472 1.0728 1.0238 0.9982 1.0163 1.0027 0.9947 1.0209 1.0044 0.9920 0.9820 0.9945
dispcorr: -0.018835795 hartree
energy: -2061.451227150683
dipole: -10.68561 11.48269 0.79708 -6.62347 7.90827 1.28480 11.63817 -10.40022 1.23795
magnitude: 1.95412 au
magnitude: 4.96697 debye
