program: Orca
programVersion: 4.2.1
elementType: Cl Cl F F F F O N N N C C C C C C C C C C C C C H H H H H H H H H H H
charge: 0
multiplicity: 1
keywords: wb97x-d3
keywords: def2-TZVPP
keywords: def2/J RIJCOSX GRIDX6 NOFINALGRIDX
keywords: grid4 nofinalgrid
keywords: scfconv7
keywords: smallprint printgap noloewdin
keywords: NOSOSCF
formula: C13H11Cl2F4N3O
InChI: InChI=1/C13H11Cl2F4N3O/c14-9-1-2-10(11(15)3-9)8(4-22-7-20-6-21-22)5-23-13(18,19)12(16)17/h1-3,6-8,12H,4-5H2
34 atoms
Cl -1.678074 -0.091507 -2.269149
Cl -2.779562 3.456923 1.565723
F  3.450374 0.463629 1.256346
F  4.395641 -0.781659 -0.230006
F  5.034767 1.822849 -0.47336
F  2.92834 2.378943 -0.626329
O  2.234785 -0.266212 -0.470646
N  -1.821134 -2.831859 0.137739
N  -2.75831 -2.415548 0.992949
N  -3.697689 -3.121505 -0.919317
C  0.208612 -1.470401 -0.21319
C  -0.411626 -2.715701 0.428648
C  1.682995 -1.432722 0.15054
C  -0.527451 -0.220668 0.198386
C  -1.403907 0.454339 -0.645277
C  -0.384207 0.283202 1.488568
C  3.432757 0.161731 -0.066247
C  -2.100783 1.584113 -0.240643
C  -1.063536 1.404954 1.926276
C  -2.394436 -3.234655 -0.99571
C  -1.919186 2.049262 1.048241
C  3.818518 1.395043 -0.880815
C  -3.858974 -2.612287 0.31573
H  0.14813 -1.592388 -1.295936
H  0.090093 -3.611512 0.063474
H  -0.303121 -2.697657 1.511959
H  1.824205 -1.408355 1.232968
H  2.1761 -2.328199 -0.232832
H  0.273005 -0.217109 2.188609
H  -2.771854 2.087852 -0.922173
H  -0.925647 1.766851 2.935307
H  -1.83247 -3.613512 -1.834861
H  3.842446 1.188812 -1.950748
H  -4.825884 -2.385768 0.736885
elementType: Cl F O N C H
totalener: -2061.43236762 hartree
nucrepener: 2365.96143289 hartree
electener: -4427.39380050 hartree
oneelecener: -7544.08194550 hartree
twoeener: 3116.68814500 hartree
cpcmener: -0.03758493 hartree
kineticenergy: 2055.88969842 hartree
xcener: -143.924634614375 hartree
chargesum: -0.0000000
charge: -0.085430 -0.088558 -0.201184 -0.201439 -0.201220 -0.199126 -0.288741 0.109953 -0.338821 -0.406933 0.092915 -0.108824 -0.089350 0.061045 -0.022135 -0.187147 0.458757 -0.118681 -0.157208 0.038596 0.092999 0.283952 0.054118 0.085738 0.139206 0.127097 0.129016 0.136818 0.141237 0.124893 0.148336 0.184348 0.123480 0.162294
qa: -0.0854 -0.0886 -0.2012 -0.2014 -0.2012 -0.1991 -0.2887 0.1100 -0.3388 -0.4069 0.0929 -0.1088 -0.0893 0.0610 -0.0221 -0.1871 0.4588 -0.1187 -0.1572 0.0386 0.0930 0.2840 0.0541 0.0857 0.1392 0.1271 0.1290 0.1368 0.1412 0.1249 0.1483 0.1843 0.1235 0.1623
va: 1.2372 1.2150 1.0952 1.0967 1.0845 1.0843 2.0764 3.3678 2.8811 3.0170 3.7740 3.9020 3.9545 3.3903 3.9650 3.9704 4.3205 4.0476 4.0348 4.0576 3.8631 4.1289 4.0503 1.0449 1.0019 1.0071 0.9956 1.0038 1.0045 1.0196 1.0033 0.9907 0.9844 0.9957
dispcorr: -0.019268226 hartree
energy: -2061.451635841330
dipole: -10.84698 12.40650 1.55952 -20.25271 18.56872 -1.68399 3.26991 -3.51673 -0.24682
magnitude: 2.30843 au
magnitude: 5.86757 debye
