program: Orca
programVersion: 4.2.1
elementType: Cl Cl F F F F O N N N C C C C C C C C C C C C C H H H H H H H H H H H
charge: 0
multiplicity: 1
keywords: wb97x-d3
keywords: def2-TZVPP
keywords: def2/J RIJCOSX GRIDX6 NOFINALGRIDX
keywords: grid4 nofinalgrid
keywords: scfconv7
keywords: smallprint printgap noloewdin
keywords: NOSOSCF
formula: C13H11Cl2F4N3O
InChI: InChI=1/C13H11Cl2F4N3O/c14-9-1-2-10(11(15)3-9)8(4-22-7-20-6-21-22)5-23-13(18,19)12(16)17/h1-3,6-8,12H,4-5H2
34 atoms
Cl -0.978817 0.892743 -2.839192
Cl -3.304123 3.413082 1.257471
F  4.094053 -1.284553 0.171852
F  3.116137 -0.339551 -1.503384
F  4.011899 1.110828 1.562333
F  3.06601 2.050406 -0.168545
O  2.059499 -0.418107 0.468529
N  -1.628989 -2.753767 -0.035256
N  -1.144464 -3.513201 0.952649
N  -3.247936 -2.880438 1.410788
C  0.105313 -1.126361 -0.784762
C  -0.806685 -2.312184 -1.13535
C  1.229736 -1.547301 0.15199
C  -0.709814 0.033664 -0.272156
C  -1.260245 0.983977 -1.130241
C  -1.01418 0.16397 1.081262
C  3.2314 -0.284789 -0.150753
C  -2.054348 2.026465 -0.677616
C  -1.807551 1.188788 1.566912
C  -2.872436 -2.375573 0.260492
C  -2.318319 2.117666 0.677098
C  3.882913 1.04646 0.218174
C  -2.150435 -3.560618 1.787941
H  0.565666 -0.848009 -1.733987
H  -1.473745 -2.027472 -1.947632
H  -0.2155 -3.156114 -1.488712
H  0.867222 -1.923378 1.105966
H  1.801722 -2.355867 -0.307346
H  -0.627488 -0.55128 1.795667
H  -2.45804 2.749997 -1.371908
H  -2.019364 1.25608 2.624591
H  -3.466672 -1.754441 -0.391188
H  4.860627 1.167404 -0.249502
H  -2.091118 -4.119968 2.708289
elementType: Cl F O N C H
totalener: -2061.43179543 hartree
nucrepener: 2379.28018107 hartree
electener: -4440.71197650 hartree
oneelecener: -7570.63307586 hartree
twoeener: 3129.92109936 hartree
cpcmener: -0.03053268 hartree
kineticenergy: 2055.87810233 hartree
xcener: -143.923968418024 hartree
chargesum: 0.0000000
charge: -0.081600 -0.085912 -0.201263 -0.203765 -0.200660 -0.198848 -0.301117 0.128143 -0.374096 -0.407818 0.071074 -0.107493 -0.043551 0.033821 -0.018369 -0.185300 0.449037 -0.119885 -0.146019 0.052492 0.087288 0.284638 0.078372 0.080559 0.132134 0.134663 0.125995 0.132895 0.147419 0.124894 0.148217 0.174782 0.126786 0.162487
qa: -0.0816 -0.0859 -0.2013 -0.2038 -0.2007 -0.1988 -0.3011 0.1281 -0.3741 -0.4078 0.0711 -0.1075 -0.0436 0.0338 -0.0184 -0.1853 0.4490 -0.1199 -0.1460 0.0525 0.0873 0.2846 0.0784 0.0806 0.1321 0.1347 0.1260 0.1329 0.1474 0.1249 0.1482 0.1748 0.1268 0.1625
va: 1.2469 1.2174 1.0969 1.0933 1.0849 1.0881 2.0855 3.3295 2.8611 3.0173 3.7996 3.9104 3.8735 3.4337 3.9821 3.9163 4.3485 4.0565 4.0520 4.0683 3.8674 4.1360 4.0290 1.0567 1.0044 1.0076 1.0223 1.0087 0.9992 1.0200 1.0036 0.9925 0.9819 0.9951
dispcorr: -0.019725296 hartree
energy: -2061.451520725500
dipole: -11.32972 11.92397 0.59426 -18.01879 17.45362 -0.56516 2.72905 -4.07244 -1.34338
magnitude: 1.57392 au
magnitude: 4.00060 debye
