program: Orca
programVersion: 4.2.1
elementType: Cl Cl F F F F O N N N C C C C C C C C C C C C C H H H H H H H H H H H
charge: 0
multiplicity: 1
keywords: wb97x-d3
keywords: def2-TZVPP
keywords: def2/J RIJCOSX GRIDX6 NOFINALGRIDX
keywords: grid4 nofinalgrid
keywords: scfconv7
keywords: smallprint printgap noloewdin
keywords: NOSOSCF
formula: C13H11Cl2F4N3O
InChI: InChI=1/C13H11Cl2F4N3O/c14-9-1-2-10(11(15)3-9)8(4-22-7-20-6-21-22)5-23-13(18,19)12(16)17/h1-3,6-8,12H,4-5H2
34 atoms
Cl -1.531025 -0.383374 -2.391055
Cl -4.824493 2.959802 0.153589
F  3.570997 0.481768 -1.519621
F  4.10104 1.640269 0.223974
F  4.650965 -1.778162 -0.333786
F  5.211031 -0.567905 1.396574
O  2.688801 -0.073692 0.45325
N  -0.966826 -2.155636 0.877286
N  -2.106201 -1.973464 1.549766
N  -2.401537 -3.460349 -0.105379
C  0.313355 -0.198305 0.121209
C  0.209557 -1.352453 1.126172
C  1.489159 0.718063 0.433246
C  -0.967195 0.597822 0.089826
C  -1.859223 0.568099 -0.978972
C  -1.328535 1.374707 1.188901
C  3.767838 0.38776 -0.17868
C  -3.046962 1.285395 -0.971247
C  -2.501484 2.105729 1.227319
C  -1.163621 -3.02982 -0.109283
C  -3.353184 2.053251 0.136938
C  4.965792 -0.52713 0.068017
C  -2.928067 -2.777621 0.927643
H  0.495753 -0.629772 -0.864665
H  1.083277 -1.99829 1.059777
H  0.146512 -0.98635 2.149767
H  1.536083 1.508926 -0.31657
H  1.391304 1.188405 1.412453
H  -0.681435 1.410611 2.055907
H  -3.718215 1.242727 -1.817367
H  -2.744576 2.700057 2.096582
H  -0.38294 -3.332709 -0.789167
H  5.857228 -0.185376 -0.45885
H  -3.955608 -2.881725 1.238886
elementType: Cl F O N C H
totalener: -2061.43071304 hartree
nucrepener: 2327.35495955 hartree
electener: -4388.78567259 hartree
oneelecener: -7466.55147278 hartree
twoeener: 3077.76580019 hartree
cpcmener: -0.03251865 hartree
kineticenergy: 2055.88362567 hartree
xcener: -143.922801013116 hartree
chargesum: 0.0000000
charge: -0.083356 -0.086087 -0.203252 -0.200408 -0.200819 -0.200314 -0.303041 0.113188 -0.338278 -0.405275 0.084328 -0.084387 -0.042908 0.006496 0.006086 -0.181036 0.437696 -0.120371 -0.164222 0.035051 0.096165 0.289572 0.053631 0.076186 0.133403 0.123710 0.129940 0.134899 0.143965 0.124711 0.148850 0.182698 0.131175 0.162005
qa: -0.0834 -0.0861 -0.2033 -0.2004 -0.2008 -0.2003 -0.3030 0.1132 -0.3383 -0.4053 0.0843 -0.0844 -0.0429 0.0065 0.0061 -0.1810 0.4377 -0.1204 -0.1642 0.0351 0.0962 0.2896 0.0536 0.0762 0.1334 0.1237 0.1299 0.1349 0.1440 0.1247 0.1488 0.1827 0.1312 0.1620
va: 1.2385 1.2174 1.0924 1.1001 1.0851 1.0863 2.0862 3.3655 2.8834 3.0177 3.7784 3.8504 3.8893 3.4820 3.9310 3.9900 4.3632 4.0540 4.0416 4.0599 3.8599 4.1322 4.0524 1.0596 1.0161 1.0112 1.0064 1.0006 1.0044 1.0195 1.0033 0.9919 0.9823 0.9963
dispcorr: -0.019031249 hartree
energy: -2061.449744288465
dipole: -8.57834 10.33497 1.75663 -5.05146 6.20783 1.15638 8.66094 -8.27328 0.38766
magnitude: 2.13851 au
magnitude: 5.43566 debye
