program: Orca
programVersion: 4.2.1
elementType: Cl Cl F F F F O N N N C C C C C C C C C C C C C H H H H H H H H H H H
charge: 0
multiplicity: 1
keywords: wb97x-d3
keywords: def2-TZVPP
keywords: def2/J RIJCOSX GRIDX6 NOFINALGRIDX
keywords: grid4 nofinalgrid
keywords: scfconv7
keywords: smallprint printgap noloewdin
keywords: NOSOSCF
formula: C13H11Cl2F4N3O
InChI: InChI=1/C13H11Cl2F4N3O/c14-9-1-2-10(11(15)3-9)8(4-22-7-20-6-21-22)5-23-13(18,19)12(16)17/h1-3,6-8,12H,4-5H2
34 atoms
Cl -1.731847 -0.280542 -2.596003
Cl -4.806634 2.980271 0.297896
F  4.296025 1.457845 0.455035
F  3.378339 0.001855 1.759481
F  5.321203 -0.577193 -1.10096
F  4.365337 -2.040945 0.210677
O  2.767239 0.06896 -0.3895
N  -0.813489 -1.893409 0.797907
N  -1.04801 -2.780465 -0.171708
N  -2.88513 -2.486366 1.083722
C  0.373971 -0.047418 -0.290827
C  0.396555 -1.107629 0.821102
C  1.585236 0.872028 -0.218707
C  -0.901628 0.754107 -0.213172
C  -1.914849 0.679991 -1.166485
C  -1.144378 1.556282 0.901022
C  3.773177 0.206127 0.474939
C  -3.114979 1.361928 -1.022921
C  -2.328917 2.248838 1.074056
C  -1.918548 -1.717542 1.52214
C  -3.310086 2.139674 0.103243
C  4.883689 -0.793268 0.15941
C  -2.294997 -3.106081 0.045257
H  0.416246 -0.570397 -1.247293
H  1.243946 -1.77968 0.7016
H  0.470176 -0.648948 1.807151
H  1.554773 1.596159 -1.032538
H  1.612672 1.42655 0.720828
H  -0.39451 1.636742 1.678117
H  -3.88415 1.279381 -1.777919
H  -2.481513 2.855198 1.955428
H  -1.968311 -1.043574 2.362728
H  5.718501 -0.712932 0.85641
H  -2.802296 -3.833105 -0.569226
elementType: Cl F O N C H
totalener: -2061.43160212 hartree
nucrepener: 2342.35602764 hartree
electener: -4403.78762976 hartree
oneelecener: -7496.47400279 hartree
twoeener: 3092.68637303 hartree
cpcmener: -0.03450958 hartree
kineticenergy: 2055.88551316 hartree
xcener: -143.923953407154 hartree
chargesum: 0.0000000
charge: -0.079069 -0.084409 -0.199738 -0.204962 -0.198946 -0.198719 -0.314685 0.113213 -0.350362 -0.406924 0.178095 -0.126776 -0.062251 -0.040236 0.006457 -0.188028 0.463980 -0.121250 -0.147749 0.058063 0.093689 0.286440 0.055645 0.081149 0.122825 0.131291 0.131219 0.123211 0.144698 0.123568 0.149532 0.173524 0.127784 0.159720
qa: -0.0791 -0.0844 -0.1997 -0.2050 -0.1989 -0.1987 -0.3147 0.1132 -0.3504 -0.4069 0.1781 -0.1268 -0.0623 -0.0402 0.0065 -0.1880 0.4640 -0.1213 -0.1477 0.0581 0.0937 0.2864 0.0556 0.0811 0.1228 0.1313 0.1312 0.1232 0.1447 0.1236 0.1495 0.1735 0.1278 0.1597
va: 1.2408 1.2190 1.1014 1.0887 1.0869 1.0868 2.0714 3.3566 2.8696 3.0184 3.5943 3.8842 3.9317 3.5572 3.9445 3.9721 4.3037 4.0602 4.0211 4.0621 3.8614 4.1438 4.0574 1.0658 1.0305 1.0003 1.0066 1.0071 1.0032 1.0204 1.0026 0.9938 0.9816 0.9973
dispcorr: -0.019838892 hartree
energy: -2061.451441010967
dipole: -7.82234 9.18669 1.36435 -2.51646 4.15735 1.64089 7.05170 -5.56455 1.48715
magnitude: 2.60108 au
magnitude: 6.61141 debye
