program: Orca
programVersion: 4.2.1
elementType: Cl Cl F F F F O N N N C C C C C C C C C C C C C H H H H H H H H H H H
charge: 0
multiplicity: 1
keywords: wb97x-d3
keywords: def2-TZVPP
keywords: def2/J RIJCOSX GRIDX6 NOFINALGRIDX
keywords: grid4 nofinalgrid
keywords: scfconv7
keywords: smallprint printgap noloewdin
keywords: NOSOSCF
formula: C13H11Cl2F4N3O
InChI: InChI=1/C13H11Cl2F4N3O/c14-9-1-2-10(11(15)3-9)8(4-22-7-20-6-21-22)5-23-13(18,19)12(16)17/h1-3,6-8,12H,4-5H2
34 atoms
Cl -1.080873 0.686412 -2.891183
Cl -3.24515 3.285677 1.245763
F  4.197962 -1.147376 -0.150546
F  2.998789 -0.067045 -1.58213
F  4.120949 1.029962 1.554153
F  2.921555 2.111146 0.082616
O  2.155454 -0.48091 0.452171
N  -1.592785 -2.724673 -0.031162
N  -1.162699 -3.350698 1.068495
N  -3.288152 -2.681014 1.32994
C  0.206698 -1.202356 -0.834857
C  -0.711522 -2.401752 -1.126429
C  1.358647 -1.612776 0.075385
C  -0.60483 -0.043265 -0.314639
C  -1.250839 0.844879 -1.172002
C  -0.821955 0.136403 1.04978
C  3.245999 -0.181968 -0.251365
C  -2.059458 1.8726 -0.71085
C  -1.627442 1.146625 1.54432
C  -2.849623 -2.319632 0.148772
C  -2.237939 2.012167 0.653432
C  3.844803 1.136379 0.23535
C  -2.212737 -3.300506 1.847653
H  0.632604 -0.936342 -1.802884
H  -1.337911 -2.177703 -1.988052
H  -0.124785 -3.283934 -1.380394
H  1.012531 -2.045049 1.011669
H  1.956417 -2.378628 -0.4227
H  -0.360819 -0.531232 1.765149
H  -2.541286 2.545823 -1.405857
H  -1.772983 1.251431 2.610159
H  -3.407541 -1.787458 -0.605749
H  4.751744 1.401719 -0.308969
H  -2.20366 -3.738817 2.833251
elementType: Cl F O N C H
totalener: -2061.43105469 hartree
nucrepener: 2394.87197512 hartree
electener: -4456.30302981 hartree
oneelecener: -7601.92170868 hartree
twoeener: 3145.61867887 hartree
cpcmener: -0.03050709 hartree
kineticenergy: 2055.88568516 hartree
xcener: -143.925976898949 hartree
chargesum: -0.0000000
charge: -0.081183 -0.086384 -0.201270 -0.204527 -0.200621 -0.199528 -0.300769 0.139030 -0.377120 -0.404736 0.063820 -0.126009 -0.035188 0.039525 -0.018892 -0.174129 0.451094 -0.118691 -0.160490 0.055527 0.094508 0.282141 0.076893 0.083812 0.136230 0.133529 0.124295 0.132790 0.143516 0.124880 0.147067 0.169956 0.128460 0.162460
qa: -0.0812 -0.0864 -0.2013 -0.2045 -0.2006 -0.1995 -0.3008 0.1390 -0.3771 -0.4047 0.0638 -0.1260 -0.0352 0.0395 -0.0189 -0.1741 0.4511 -0.1187 -0.1605 0.0555 0.0945 0.2821 0.0769 0.0838 0.1362 0.1335 0.1243 0.1328 0.1435 0.1249 0.1471 0.1700 0.1285 0.1625
va: 1.2481 1.2169 1.0976 1.0931 1.0849 1.0873 2.0856 3.3082 2.8509 3.0179 3.7738 3.9159 3.8645 3.4316 3.9715 3.9043 4.3486 4.0560 4.0727 4.0666 3.8625 4.1349 4.0271 1.0506 1.0026 1.0083 1.0256 1.0068 1.0018 1.0202 1.0041 0.9948 0.9820 0.9950
dispcorr: -0.020158207 hartree
energy: -2061.451212900761
dipole: -10.51909 11.26530 0.74621 -18.00546 17.32988 -0.67558 2.66457 -4.10283 -1.43826
magnitude: 1.75551 au
magnitude: 4.46215 debye
