program: Orca
programVersion: 4.2.1
elementType: Cl Cl F F F F O N N N C C C C C C C C C C C C C H H H H H H H H H H H
charge: 0
multiplicity: 1
keywords: wb97x-d3
keywords: def2-TZVPP
keywords: def2/J RIJCOSX GRIDX6 NOFINALGRIDX
keywords: grid4 nofinalgrid
keywords: scfconv7
keywords: smallprint printgap noloewdin
keywords: NOSOSCF
formula: C13H11Cl2F4N3O
InChI: InChI=1/C13H11Cl2F4N3O/c14-9-1-2-10(11(15)3-9)8(4-22-7-20-6-21-22)5-23-13(18,19)12(16)17/h1-3,6-8,12H,4-5H2
34 atoms
Cl -1.4326 -0.390745 -2.248097
Cl -4.949355 2.920751 0.021276
F  2.971229 -0.263402 -1.289029
F  3.983234 1.439728 -0.436305
F  4.270556 -1.929905 0.48836
F  5.323532 -0.20003 1.309572
O  2.659351 0.21457 0.87645
N  -0.854428 -2.139671 0.923319
N  -0.602186 -3.060983 -0.009996
N  -2.789131 -3.033768 0.494211
C  0.289852 -0.054038 0.333018
C  0.158954 -1.200466 1.342537
C  1.411386 0.906998 0.720697
C  -1.013661 0.697514 0.21506
C  -1.851862 0.605642 -0.893978
C  -1.458057 1.489541 1.273068
C  3.526198 0.197839 -0.138802
C  -3.059245 1.285097 -0.967367
C  -2.657214 2.177687 1.233398
C  -2.158604 -2.124857 1.198362
C  -3.447972 2.07043 0.102348
C  4.721924 -0.688137 0.202262
C  -1.786868 -3.567808 -0.227854
H  0.536743 -0.492316 -0.633952
H  1.097205 -1.743131 1.441298
H  -0.110552 -0.82841 2.331085
H  1.486682 1.712816 -0.010966
H  1.226397 1.365139 1.690802
H  -0.858162 1.572985 2.170018
H  -3.684471 1.19573 -1.844293
H  -2.964992 2.782858 2.074241
H  -2.598255 -1.460963 1.926414
H  5.441561 -0.737127 -0.615919
H  -1.935269 -4.369093 -0.934937
elementType: Cl F O N C H
totalener: -2061.43187197 hartree
nucrepener: 2350.46565722 hartree
electener: -4411.89752919 hartree
oneelecener: -7512.94330533 hartree
twoeener: 3101.04577614 hartree
cpcmener: -0.03445130 hartree
kineticenergy: 2055.88293115 hartree
xcener: -143.923752465653 hartree
chargesum: 0.0000000
charge: -0.080679 -0.084035 -0.201763 -0.198169 -0.199892 -0.199076 -0.312084 0.122094 -0.349268 -0.407156 0.095280 -0.095138 -0.033721 -0.055474 0.037719 -0.176727 0.456252 -0.127071 -0.165501 0.050373 0.103052 0.280674 0.058156 0.074571 0.119966 0.134219 0.136842 0.133505 0.145608 0.124869 0.149169 0.172900 0.130157 0.160347
qa: -0.0807 -0.0840 -0.2018 -0.1982 -0.1999 -0.1991 -0.3121 0.1221 -0.3493 -0.4072 0.0953 -0.0951 -0.0337 -0.0555 0.0377 -0.1767 0.4563 -0.1271 -0.1655 0.0504 0.1031 0.2807 0.0582 0.0746 0.1200 0.1342 0.1368 0.1335 0.1456 0.1249 0.1492 0.1729 0.1302 0.1603
va: 1.2428 1.2198 1.0939 1.1026 1.0881 1.0868 2.0774 3.3476 2.8757 3.0127 3.7024 3.8540 3.8910 3.5089 3.9207 3.9847 4.3267 4.0696 4.0437 4.0703 3.8602 4.1349 4.0547 1.0805 1.0330 0.9989 1.0087 1.0009 1.0060 1.0206 1.0038 0.9940 0.9819 0.9964
dispcorr: -0.019575453 hartree
energy: -2061.451447421959
dipole: -8.76406 9.52536 0.76130 -3.28359 5.01029 1.72670 9.89011 -8.70159 1.18851
magnitude: 2.23017 au
magnitude: 5.66863 debye
