program: Orca
programVersion: 4.2.1
elementType: Cl Cl F F F F O N N N C C C C C C C C C C C C C H H H H H H H H H H H
charge: 0
multiplicity: 1
keywords: wb97x-d3
keywords: def2-TZVPP
keywords: def2/J RIJCOSX GRIDX6 NOFINALGRIDX
keywords: grid4 nofinalgrid
keywords: scfconv7
keywords: smallprint printgap noloewdin
keywords: NOSOSCF
formula: C13H11Cl2F4N3O
InChI: InChI=1/C13H11Cl2F4N3O/c14-9-1-2-10(11(15)3-9)8(4-22-7-20-6-21-22)5-23-13(18,19)12(16)17/h1-3,6-8,12H,4-5H2
34 atoms
Cl -1.683315 0.776047 -3.102885
Cl -3.028449 3.533494 1.271071
F  2.703492 -0.257913 1.579187
F  3.983205 -1.30604 0.196024
F  4.959717 1.090733 0.973683
F  3.160746 2.102735 0.259777
O  2.154751 -0.288231 -0.58778
N  -1.479574 -2.678579 -0.157069
N  -0.814121 -3.546104 0.612376
N  -2.672858 -2.841888 1.653143
C  0.004165 -1.019865 -1.276775
C  -0.949992 -2.214949 -1.417311
C  1.28517 -1.4302 -0.57169
C  -0.706152 0.150325 -0.642219
C  -1.520496 1.000024 -1.390384
C  -0.649238 0.390387 0.728466
C  3.15277 -0.237761 0.297751
C  -2.237361 2.04069 -0.820907
C  -1.350983 1.420873 1.33017
C  -2.571287 -2.259399 0.483075
C  -2.141312 2.24089 0.544587
C  3.963903 1.0345 0.060975
C  -1.570379 -3.6125 1.677632
H  0.281001 -0.757771 -2.300945
H  -1.791577 -1.942629 -2.051909
H  -0.445113 -3.049381 -1.901652
H  1.108703 -1.775994 0.447133
H  1.748253 -2.249958 -1.124078
H  -0.047022 -0.240373 1.36716
H  -2.857619 2.679427 -1.433928
H  -1.278604 1.574196 2.397456
H  -3.270317 -1.556962 0.056826
H  4.385094 1.07207 -0.943455
H  -1.31696 -4.252645 2.507863
elementType: Cl F O N C H
totalener: -2061.43283775 hartree
nucrepener: 2370.20311904 hartree
electener: -4431.63595679 hartree
oneelecener: -7552.13157971 hartree
twoeener: 3120.49562292 hartree
cpcmener: -0.03026946 hartree
kineticenergy: 2055.87461060 hartree
xcener: -143.923874949907 hartree
chargesum: -0.0000000
charge: -0.080939 -0.085098 -0.201227 -0.199923 -0.200987 -0.199631 -0.299710 0.124189 -0.369116 -0.409529 0.140593 -0.126590 -0.101012 -0.009809 -0.004485 -0.170271 0.466821 -0.127102 -0.145597 0.051677 0.094583 0.284163 0.079921 0.089144 0.139254 0.132150 0.115241 0.140451 0.140133 0.124638 0.147640 0.173377 0.123409 0.163641
qa: -0.0809 -0.0851 -0.2012 -0.1999 -0.2010 -0.1996 -0.2997 0.1242 -0.3691 -0.4095 0.1406 -0.1266 -0.1010 -0.0098 -0.0045 -0.1703 0.4668 -0.1271 -0.1456 0.0517 0.0946 0.2842 0.0799 0.0891 0.1393 0.1322 0.1152 0.1405 0.1401 0.1246 0.1476 0.1734 0.1234 0.1636
va: 1.2489 1.2183 1.0945 1.1001 1.0850 1.0838 2.0776 3.3346 2.8734 3.0214 3.7447 3.8843 3.9353 3.4659 3.9709 3.8706 4.3010 4.0696 4.0590 4.0765 3.8678 4.1328 4.0276 1.0360 1.0070 1.0135 1.0177 1.0054 1.0114 1.0203 1.0040 0.9918 0.9843 0.9944
dispcorr: -0.019628232 hartree
energy: -2061.452465984112
dipole: -10.78822 10.83930 0.05108 -17.32220 16.88170 -0.44050 -3.09338 0.94402 -2.14936
magnitude: 2.19463 au
magnitude: 5.57832 debye
