program: Orca
programVersion: 4.2.1
elementType: Cl Cl F F F F O N N N C C C C C C C C C C C C C H H H H H H H H H H H
charge: 0
multiplicity: 1
keywords: wb97x-d3
keywords: def2-TZVPP
keywords: def2/J RIJCOSX GRIDX6 NOFINALGRIDX
keywords: grid4 nofinalgrid
keywords: scfconv7
keywords: smallprint printgap noloewdin
keywords: NOSOSCF
formula: C13H11Cl2F4N3O
InChI: InChI=1/C13H11Cl2F4N3O/c14-9-1-2-10(11(15)3-9)8(4-22-7-20-6-21-22)5-23-13(18,19)12(16)17/h1-3,6-8,12H,4-5H2
34 atoms
Cl -1.735399 0.756249 -2.975817
Cl -3.021236 3.275337 1.558325
F  3.100621 -0.797109 1.456187
F  4.184583 -1.161029 -0.374866
F  3.03541 1.887746 0.922719
F  4.119753 1.546931 -0.943043
O  2.141472 -0.26943 -0.493906
N  -1.501966 -2.695646 -0.202484
N  -0.848076 -3.349454 0.762689
N  -2.887025 -2.739498 1.473799
C  0.04961 -1.076421 -1.276504
C  -0.862922 -2.30394 -1.435678
C  1.361183 -1.46757 -0.61596
C  -0.68477 0.037053 -0.572692
C  -1.533915 0.902901 -1.259039
C  -0.60494 0.204857 0.808027
C  3.281241 -0.323101 0.196313
C  -2.257333 1.89981 -0.622241
C  -1.316699 1.185094 1.47627
C  -2.703245 -2.327546 0.243132
C  -2.135291 2.031609 0.748952
C  3.909437 1.065119 0.302068
C  -1.718881 -3.351098 1.739307
H  0.290955 -0.760571 -2.293997
H  -1.650759 -2.083864 -2.15345
H  -0.301855 -3.151389 -1.827239
H  1.211249 -1.932603 0.358617
H  1.873578 -2.187451 -1.257096
H  0.024609 -0.446795 1.398881
H  -2.901655 2.557382 -1.188777
H  -1.226845 1.284217 2.548567
H  -3.411751 -1.783879 -0.362232
H  4.850675 1.046072 0.8527
H  -1.502926 -3.824399 2.684276
elementType: Cl F O N C H
totalener: -2061.43247952 hartree
nucrepener: 2385.33712371 hartree
electener: -4446.76960323 hartree
oneelecener: -7582.90842442 hartree
twoeener: 3136.13882118 hartree
cpcmener: -0.03047688 hartree
kineticenergy: 2055.87852299 hartree
xcener: -143.924722192554 hartree
chargesum: -0.0000000
charge: -0.080771 -0.085972 -0.203218 -0.200999 -0.199031 -0.200202 -0.290658 0.137025 -0.375123 -0.404683 0.100688 -0.132277 -0.085762 0.029267 -0.013048 -0.168275 0.450709 -0.118466 -0.158433 0.055724 0.092253 0.284452 0.076761 0.090268 0.137044 0.132550 0.123855 0.139676 0.132430 0.124720 0.147033 0.170778 0.129374 0.162308
qa: -0.0808 -0.0860 -0.2032 -0.2010 -0.1990 -0.2002 -0.2907 0.1370 -0.3751 -0.4047 0.1007 -0.1323 -0.0858 0.0293 -0.0130 -0.1683 0.4507 -0.1185 -0.1584 0.0557 0.0923 0.2845 0.0768 0.0903 0.1370 0.1326 0.1239 0.1397 0.1324 0.1247 0.1470 0.1708 0.1294 0.1623
va: 1.2488 1.2172 1.0937 1.0983 1.0875 1.0857 2.0892 3.3112 2.8544 3.0185 3.7747 3.9030 3.8984 3.4516 3.9629 3.8796 4.3276 4.0580 4.0757 4.0672 3.8660 4.1410 4.0282 1.0361 1.0050 1.0109 1.0232 1.0047 1.0095 1.0199 1.0041 0.9941 0.9817 0.9952
dispcorr: -0.019921991 hartree
energy: -2061.452401514664
dipole: -9.57991 10.14497 0.56506 -17.31024 16.61385 -0.69639 -0.09092 -0.99464 -1.08556
magnitude: 1.40808 au
magnitude: 3.57905 debye
