program: Orca
programVersion: 4.2.1
elementType: Cl Cl F F F F O N N N C C C C C C C C C C C C C H H H H H H H H H H H
charge: 0
multiplicity: 1
keywords: wb97x-d3
keywords: def2-TZVPP
keywords: def2/J RIJCOSX GRIDX6 NOFINALGRIDX
keywords: grid4 nofinalgrid
keywords: scfconv7
keywords: smallprint printgap noloewdin
keywords: NOSOSCF
formula: C13H11Cl2F4N3O
InChI: InChI=1/C13H11Cl2F4N3O/c14-9-1-2-10(11(15)3-9)8(4-22-7-20-6-21-22)5-23-13(18,19)12(16)17/h1-3,6-8,12H,4-5H2
34 atoms
Cl -1.894686 -0.353904 -2.398071
Cl -4.820866 3.121441 0.404313
F  4.079853 1.467935 -0.660576
F  3.97881 0.698451 1.351817
F  4.6149 -1.819316 0.441152
F  6.072381 -0.27257 -0.065921
O  2.586372 -0.124591 -0.18916
N  -0.976648 -2.141399 0.729845
N  -2.118933 -1.881054 1.368035
N  -2.364633 -3.646103 0.013072
C  0.217934 -0.153219 -0.118611
C  0.190691 -1.307649 0.892307
C  1.4534 0.715234 0.075273
C  -1.035378 0.680455 -0.026482
C  -2.040557 0.646878 -0.98951
C  -1.256284 1.493683 1.083206
C  3.811729 0.346174 0.053597
C  -3.205293 1.390831 -0.870261
C  -2.404075 2.250611 1.23185
C  -1.138792 -3.191329 -0.079003
C  -3.373491 2.190375 0.245034
C  4.828687 -0.72904 -0.328455
C  -2.920063 -2.808857 0.911001
H  0.287778 -0.585368 -1.118631
H  1.070409 -1.937406 0.769801
H  0.19265 -0.935674 1.91675
H  1.431782 1.550513 -0.627189
H  1.507724 1.116093 1.089619
H  -0.517383 1.537057 1.873431
H  -3.967752 1.340838 -1.635161
H  -2.538538 2.870193 2.107388
H  -0.347005 -3.583816 -0.698277
H  4.755325 -1.00458 -1.381037
H  -3.944716 -2.887758 1.240069
elementType: Cl F O N C H
totalener: -2061.44192463 hartree
nucrepener: 2306.25690771 hartree
electener: -4367.69883234 hartree
oneelecener: -7424.04122872 hartree
twoeener: 3056.34239638 hartree
cpcmener: -0.02918200 hartree
kineticenergy: 2055.85410504 hartree
xcener: -143.917547479451 hartree
chargesum: -0.0000000
charge: -0.082311 -0.084343 -0.198887 -0.197262 -0.198101 -0.197085 -0.297268 0.112526 -0.337983 -0.404301 0.114292 -0.106196 -0.059595 -0.015713 0.014059 -0.161254 0.442313 -0.130083 -0.171412 0.049093 0.102789 0.288559 0.059524 0.078173 0.128548 0.123841 0.134832 0.125513 0.140188 0.123710 0.145784 0.178456 0.119282 0.160311
qa: -0.0823 -0.0843 -0.1989 -0.1973 -0.1981 -0.1971 -0.2973 0.1125 -0.3380 -0.4043 0.1143 -0.1062 -0.0596 -0.0157 0.0141 -0.1613 0.4423 -0.1301 -0.1714 0.0491 0.1028 0.2886 0.0595 0.0782 0.1285 0.1238 0.1348 0.1255 0.1402 0.1237 0.1458 0.1785 0.1193 0.1603
va: 1.2395 1.2191 1.0992 1.1024 1.0847 1.0905 2.0778 3.3583 2.8723 3.0248 3.7283 3.8701 3.9292 3.4995 3.9428 3.9781 4.3443 4.0625 4.0566 4.0542 3.8659 4.1261 4.0436 1.0579 1.0191 1.0097 1.0018 1.0036 1.0032 1.0203 1.0049 0.9914 0.9853 0.9956
dispcorr: -0.018626950 hartree
energy: -2061.460551583253
dipole: -10.27087 11.28745 1.01658 -6.25454 6.93151 0.67697 4.96520 -5.24353 -0.27833
magnitude: 1.25267 au
magnitude: 3.18403 debye
