program: Orca
programVersion: 4.2.1
elementType: Cl Cl F F F F O N N N C C C C C C C C C C C C C H H H H H H H H H H H
charge: 0
multiplicity: 1
keywords: wb97x-d3
keywords: def2-TZVPP
keywords: def2/J RIJCOSX GRIDX6 NOFINALGRIDX
keywords: grid4 nofinalgrid
keywords: scfconv7
keywords: smallprint printgap noloewdin
keywords: NOSOSCF
formula: C13H11Cl2F4N3O
InChI: InChI=1/C13H11Cl2F4N3O/c14-9-1-2-10(11(15)3-9)8(4-22-7-20-6-21-22)5-23-13(18,19)12(16)17/h1-3,6-8,12H,4-5H2
34 atoms
Cl -1.464017 1.266499 -2.875716
Cl -4.999933 2.738454 0.850593
F  3.732419 -0.019017 1.866521
F  3.105421 -1.889494 0.987678
F  5.296118 0.521977 -0.306214
F  4.609133 -1.312837 -1.274428
O  2.60232 0.017025 -0.059589
N  -0.714029 -1.994277 -0.049502
N  -2.047167 -2.00429 -0.112671
N  -1.341763 -3.225059 1.625182
C  0.294254 0.224726 -0.581673
C  0.068555 -1.238485 -0.999504
C  1.335181 0.362289 0.521662
C  -1.008312 0.892163 -0.221356
C  -1.881892 1.371125 -1.19611
C  -1.425427 1.00819 1.101594
C  3.507354 -0.62497 0.676007
C  -3.105601 1.940112 -0.884324
C  -2.64102 1.57238 1.449166
C  -0.307741 -2.726269 0.99245
C  -3.47444 2.033206 0.446335
C  4.832626 -0.726187 -0.078422
C  -2.37947 -2.752411 0.907328
H  0.709649 0.725846 -1.460387
H  -0.45514 -1.279058 -1.952019
H  1.022239 -1.744734 -1.144913
H  1.386811 1.394867 0.870805
H  1.11029 -0.27148 1.382526
H  -0.796789 0.645807 1.904175
H  -3.756672 2.303877 -1.667116
H  -2.927967 1.644067 2.488946
H  0.730594 -2.880017 1.23916
H  5.577624 -1.2976 0.477149
H  -3.41015 -2.969649 1.141803
elementType: Cl F O N C H
totalener: -2061.44029987 hartree
nucrepener: 2338.38651517 hartree
electener: -4399.82681504 hartree
oneelecener: -7488.33805876 hartree
twoeener: 3088.51124372 hartree
cpcmener: -0.02624427 hartree
kineticenergy: 2055.84435217 hartree
xcener: -143.917053935354 hartree
chargesum: 0.0000000
charge: -0.081945 -0.085414 -0.197251 -0.207131 -0.196354 -0.197176 -0.296712 0.113347 -0.333152 -0.407272 0.150650 -0.133697 -0.124429 -0.000990 -0.015592 -0.134926 0.459126 -0.134296 -0.183388 0.049225 0.109122 0.290805 0.065365 0.087161 0.135548 0.133046 0.155559 0.115944 0.136660 0.124554 0.145320 0.175234 0.122447 0.160613
qa: -0.0819 -0.0854 -0.1973 -0.2071 -0.1964 -0.1972 -0.2967 0.1133 -0.3332 -0.4073 0.1506 -0.1337 -0.1244 -0.0010 -0.0156 -0.1349 0.4591 -0.1343 -0.1834 0.0492 0.1091 0.2908 0.0654 0.0872 0.1355 0.1330 0.1556 0.1159 0.1367 0.1246 0.1453 0.1752 0.1224 0.1606
va: 1.2472 1.2179 1.1060 1.0870 1.0916 1.0886 2.0852 3.3406 2.8731 3.0403 3.6749 3.8402 3.9462 3.5368 4.0039 3.8922 4.2931 4.0785 4.0841 4.0484 3.8611 4.1514 4.0373 1.0397 1.0216 1.0243 1.0018 1.0017 1.0028 1.0198 1.0054 1.0063 0.9833 0.9959
dispcorr: -0.019567117 hartree
energy: -2061.459866986277
dipole: -7.55902 8.90120 1.34218 -6.43371 6.79868 0.36497 4.61345 -4.35331 0.26014
magnitude: 1.41503 au
magnitude: 3.59672 debye
