program: Orca
programVersion: 4.2.1
elementType: Cl Cl F F F F O N N N C C C C C C C C C C C C C H H H H H H H H H H H
charge: 0
multiplicity: 1
keywords: wb97x-d3
keywords: def2-TZVPP
keywords: def2/J RIJCOSX GRIDX6 NOFINALGRIDX
keywords: grid4 nofinalgrid
keywords: scfconv7
keywords: smallprint printgap noloewdin
keywords: NOSOSCF
formula: C13H11Cl2F4N3O
InChI: InChI=1/C13H11Cl2F4N3O/c14-9-1-2-10(11(15)3-9)8(4-22-7-20-6-21-22)5-23-13(18,19)12(16)17/h1-3,6-8,12H,4-5H2
34 atoms
Cl -1.676036 -0.348061 -2.673196
Cl -4.706308 3.18044 -0.052535
F  4.233993 1.410631 0.317008
F  3.370172 0.096048 1.797649
F  5.247729 -0.765043 -1.037439
F  4.340752 -2.094743 0.442107
O  2.700495 -0.077313 -0.326082
N  -0.852484 -2.017688 0.862505
N  -0.98183 -2.953336 -0.078341
N  -2.817698 -2.869028 1.199453
C  0.305764 -0.171715 -0.258094
C  0.312053 -1.167372 0.90758
C  1.524905 0.741711 -0.22728
C  -0.951038 0.663306 -0.248153
C  -1.896433 0.644318 -1.271098
C  -1.219286 1.492751 0.840079
C  3.726684 0.162465 0.486877
C  -3.051876 1.412169 -1.221964
C  -2.35984 2.270697 0.919102
C  -1.954897 -1.971201 1.612042
C  -3.271071 2.221319 -0.122397
C  4.84151 -0.854033 0.247948
C  -2.17135 -3.440784 0.165785
H  0.351641 -0.751207 -1.181591
H  1.194867 -1.803202 0.865348
H  0.314773 -0.660439 1.872609
H  1.509049 1.416188 -1.084382
H  1.538967 1.353976 0.676852
H  -0.520653 1.53702 1.666586
H  -3.768127 1.374152 -2.030924
H  -2.530404 2.90051 1.780902
H  -2.07724 -1.285531 2.436216
H  5.692446 -0.694187 0.912641
H  -2.58904 -4.241814 -0.424422
elementType: Cl F O N C H
totalener: -2061.44243567 hartree
nucrepener: 2324.95622484 hartree
electener: -4386.39866051 hartree
oneelecener: -7461.64607976 hartree
twoeener: 3075.24741926 hartree
cpcmener: -0.03007384 hartree
kineticenergy: 2055.85479437 hartree
xcener: -143.917910393516 hartree
chargesum: 0.0000000
charge: -0.074924 -0.081775 -0.199489 -0.205572 -0.195961 -0.196718 -0.305822 0.118330 -0.346300 -0.407020 0.166670 -0.139965 -0.056847 -0.043502 0.015032 -0.182302 0.456963 -0.121849 -0.158313 0.063719 0.096362 0.287689 0.059468 0.081599 0.124539 0.129347 0.130163 0.120603 0.141772 0.122789 0.147364 0.170557 0.123538 0.159854
qa: -0.0749 -0.0818 -0.1995 -0.2056 -0.1960 -0.1967 -0.3058 0.1183 -0.3463 -0.4070 0.1667 -0.1400 -0.0568 -0.0435 0.0150 -0.1823 0.4570 -0.1218 -0.1583 0.0637 0.0964 0.2877 0.0595 0.0816 0.1245 0.1293 0.1302 0.1206 0.1418 0.1228 0.1474 0.1706 0.1235 0.1599
va: 1.2463 1.2216 1.1020 1.0876 1.0910 1.0896 2.0798 3.3564 2.8695 3.0273 3.6116 3.8978 3.9249 3.5358 3.9671 3.9682 4.3141 4.0542 4.0414 4.0523 3.8697 4.1466 4.0532 1.0675 1.0299 1.0002 1.0063 1.0063 1.0036 1.0208 1.0038 0.9951 0.9825 0.9959
dispcorr: -0.019051130 hartree
energy: -2061.461486802161
dipole: -8.21473 9.39288 1.17816 -3.25413 4.93440 1.68027 7.59554 -6.22742 1.36812
magnitude: 2.46639 au
magnitude: 6.26907 debye
