program: Orca
programVersion: 4.2.1
elementType: Cl Cl F F F F O N N N C C C C C C C C C C C C C H H H H H H H H H H H
charge: 0
multiplicity: 1
keywords: wb97x-d3
keywords: def2-TZVPP
keywords: def2/J RIJCOSX GRIDX6 NOFINALGRIDX
keywords: grid4 nofinalgrid
keywords: scfconv7
keywords: smallprint printgap noloewdin
keywords: NOSOSCF
formula: C13H11Cl2F4N3O
InChI: InChI=1/C13H11Cl2F4N3O/c14-9-1-2-10(11(15)3-9)8(4-22-7-20-6-21-22)5-23-13(18,19)12(16)17/h1-3,6-8,12H,4-5H2
34 atoms
Cl -2.361673 -0.705407 -2.448351
Cl -3.143299 3.713457 0.43773
F  4.309867 -0.3230 -0.984394
F  3.090991 1.444529 -0.771111
F  3.204476 1.215578 1.970188
F  5.14983 1.338821 0.98386
O  2.331751 -0.491755 0.03621
N  -1.267683 -2.654403 0.7266
N  -1.792031 -3.588961 -0.06668
N  -3.32137 -2.855586 1.393072
C  0.147304 -1.227819 -0.676151
C  0.0799 -2.180002 0.523301
C  1.582379 -0.955661 -1.09666
C  -0.672255 0.017149 -0.429948
C  -1.81651 0.325568 -1.164906
C  -0.332966 0.902149 0.594718
C  3.406125 0.272635 -0.166986
C  -2.581857 1.455182 -0.910243
C  -1.072983 2.037578 0.871134
C  -2.190546 -2.220467 1.587086
C  -2.19754 2.305072 0.109502
C  4.074781 0.545779 1.180173
C  -3.020776 -3.681296 0.372523
H  -0.271534 -1.768791 -1.526765
H  0.721681 -3.04555 0.358013
H  0.404719 -1.701853 1.446092
H  2.0306 -1.883358 -1.457859
H  1.596667 -0.230802 -1.912208
H  0.531591 0.704558 1.211445
H  -3.465245 1.661193 -1.498295
H  -0.775118 2.698386 1.673181
H  -1.993694 -1.459725 2.326086
H  4.383548 -0.37488 1.676303
H  -3.728605 -4.372026 -0.058466
elementType: Cl F O N C H
totalener: -2061.44241768 hartree
nucrepener: 2351.83964891 hartree
electener: -4413.28206659 hartree
oneelecener: -7515.17592825 hartree
twoeener: 3101.89386166 hartree
cpcmener: -0.02847117 hartree
kineticenergy: 2055.85955680 hartree
xcener: -143.919292424090 hartree
chargesum: 0.0000000
charge: -0.078383 -0.082705 -0.198020 -0.199433 -0.196851 -0.196358 -0.309332 0.122446 -0.349682 -0.406016 0.125958 -0.129926 -0.038487 -0.052701 0.024414 -0.180915 0.455891 -0.121593 -0.163981 0.059499 0.098394 0.284787 0.063117 0.090542 0.128178 0.130648 0.132637 0.128859 0.141305 0.123857 0.143713 0.170325 0.119472 0.160339
qa: -0.0784 -0.0827 -0.1980 -0.1994 -0.1969 -0.1964 -0.3093 0.1224 -0.3497 -0.4060 0.1260 -0.1299 -0.0385 -0.0527 0.0244 -0.1809 0.4559 -0.1216 -0.1640 0.0595 0.0984 0.2848 0.0631 0.0905 0.1282 0.1306 0.1326 0.1289 0.1413 0.1239 0.1437 0.1703 0.1195 0.1603
va: 1.2447 1.2209 1.1024 1.0978 1.0841 1.0916 2.0665 3.3471 2.8729 3.0238 3.7125 3.9166 3.9022 3.5363 3.9463 3.9511 4.3256 4.0504 4.0547 4.0582 3.8721 4.1215 4.0498 1.0618 1.0124 0.9998 0.9965 1.0009 1.0198 1.0209 1.0062 0.9953 0.9857 0.9955
dispcorr: -0.019499037 hartree
energy: -2061.461916715344
dipole: -7.70075 9.24180 1.54105 -16.69526 16.08581 -0.60944 3.77787 -3.38697 0.39090
magnitude: 1.70266 au
magnitude: 4.32782 debye
