program: Orca
programVersion: 4.2.1
elementType: Cl Cl F F F F O N N N C C C C C C C C C C C C C H H H H H H H H H H H
charge: 0
multiplicity: 1
keywords: wb97x-d3
keywords: def2-TZVPP
keywords: def2/J RIJCOSX GRIDX6 NOFINALGRIDX
keywords: grid4 nofinalgrid
keywords: scfconv7
keywords: smallprint printgap noloewdin
keywords: NOSOSCF
formula: C13H11Cl2F4N3O
InChI: InChI=1/C13H11Cl2F4N3O/c14-9-1-2-10(11(15)3-9)8(4-22-7-20-6-21-22)5-23-13(18,19)12(16)17/h1-3,6-8,12H,4-5H2
34 atoms
Cl -1.680692 -0.148908 -2.672226
Cl -4.758025 3.126989 0.205396
F  4.258494 1.474115 0.40048
F  3.415927 0.028674 1.766152
F  5.29955 -0.559336 -1.132943
F  4.403119 -2.027319 0.215776
O  2.737861 0.029667 -0.361587
N  -0.850261 -1.902712 0.800255
N  -1.092313 -2.755503 -0.195299
N  -2.815222 -2.710265 1.233123
C  0.343674 -0.052607 -0.287828
C  0.353141 -1.108233 0.82611
C  1.567839 0.850346 -0.210295
C  -0.917503 0.772753 -0.222218
C  -1.893116 0.76472 -1.216683
C  -1.175708 1.551129 0.905472
C  3.766148 0.211356 0.464292
C  -3.073255 1.485823 -1.097512
C  -2.340179 2.282145 1.053888
C  -1.887455 -1.877143 1.639165
C  -3.285679 2.237258 0.043272
C  4.891057 -0.76929 0.137058
C  -2.278881 -3.217337 0.106498
H  0.383517 -0.581228 -1.241374
H  1.205274 -1.776932 0.715304
H  0.419311 -0.647407 1.811988
H  1.55388 1.573447 -1.026432
H  1.590533 1.407867 0.728183
H  -0.452671 1.585568 1.711148
H  -3.814478 1.454391 -1.883874
H  -2.50499 2.869568 1.946166
H  -1.917815 -1.254562 2.519843
H  5.738025 -0.661906 0.816422
H  -2.776244 -3.952662 -0.506954
elementType: Cl F O N C H
totalener: -2061.44190515 hartree
nucrepener: 2328.15932821 hartree
electener: -4389.60123336 hartree
oneelecener: -7468.08118572 hartree
twoeener: 3078.47995237 hartree
cpcmener: -0.02997616 hartree
kineticenergy: 2055.85639618 hartree
xcener: -143.918296714524 hartree
chargesum: -0.0000000
charge: -0.074897 -0.082415 -0.199075 -0.206134 -0.195997 -0.196775 -0.306655 0.115976 -0.346898 -0.407038 0.175310 -0.140856 -0.060656 -0.034533 0.006120 -0.185536 0.459817 -0.120582 -0.154108 0.067026 0.094499 0.287308 0.059523 0.081331 0.125583 0.125330 0.131515 0.120199 0.140445 0.122675 0.147409 0.169910 0.122774 0.159407
qa: -0.0749 -0.0824 -0.1991 -0.2061 -0.1960 -0.1968 -0.3067 0.1160 -0.3469 -0.4070 0.1753 -0.1409 -0.0607 -0.0345 0.0061 -0.1855 0.4598 -0.1206 -0.1541 0.0670 0.0945 0.2873 0.0595 0.0813 0.1256 0.1253 0.1315 0.1202 0.1404 0.1227 0.1474 0.1699 0.1228 0.1594
va: 1.2457 1.2208 1.1026 1.0872 1.0912 1.0894 2.0800 3.3585 2.8678 3.0292 3.6028 3.9003 3.9284 3.5479 3.9654 3.9717 4.3082 4.0541 4.0372 4.0510 3.8697 4.1489 4.0531 1.0657 1.0277 1.0014 1.0062 1.0069 1.0040 1.0208 1.0037 0.9951 0.9825 0.9964
dispcorr: -0.019208854 hartree
energy: -2061.461114002353
dipole: -8.06092 9.34461 1.28369 -3.22950 4.78535 1.55585 7.53492 -6.15408 1.38085
magnitude: 2.44444 au
magnitude: 6.21327 debye
