program: Orca
programVersion: 4.2.1
elementType: Cl Cl F F F F O N N N C C C C C C C C C C C C C H H H H H H H H H H H
charge: 0
multiplicity: 1
keywords: wb97x-d3
keywords: def2-TZVPP
keywords: def2/J RIJCOSX GRIDX6 NOFINALGRIDX
keywords: grid4 nofinalgrid
keywords: scfconv7
keywords: smallprint printgap noloewdin
keywords: NOSOSCF
formula: C13H11Cl2F4N3O
InChI: InChI=1/C13H11Cl2F4N3O/c14-9-1-2-10(11(15)3-9)8(4-22-7-20-6-21-22)5-23-13(18,19)12(16)17/h1-3,6-8,12H,4-5H2
34 atoms
Cl -2.124601 -0.518502 -2.617089
Cl -2.911854 3.736037 0.508207
F  4.223475 -0.135723 -1.083737
F  2.813458 1.455744 -0.715392
F  3.113552 1.076171 2.018955
F  4.941513 1.560253 0.925702
O  2.344383 -0.594303 0.029469
N  -1.300301 -2.717699 0.74922
N  -1.909628 -3.552607 -0.093198
N  -3.34456 -2.828929 1.464504
C  0.150374 -1.337654 -0.654666
C  0.066098 -2.30974 0.526172
C  1.587443 -1.090408 -1.084497
C  -0.620824 -0.067344 -0.38605
C  -1.657596 0.375423 -1.206257
C  -0.327386 0.719693 0.728168
C  3.303014 0.306588 -0.189633
C  -2.367257 1.538961 -0.944286
C  -1.014111 1.885591 1.015532
C  -2.168169 -2.285837 1.6666
C  -2.033979 2.286492 0.169752
C  4.015297 0.599132 1.130798
C  -3.130531 -3.59177 0.375261
H  -0.292984 -1.852937 -1.50895
H  0.660334 -3.200808 0.322875
H  0.436727 -1.873939 1.452592
H  2.035749 -2.029265 -1.414883
H  1.601902 -0.396218 -1.926191
H  0.455977 0.418261 1.408748
H  -3.167855 1.850878 -1.600227
H  -0.755101 2.46811 1.888669
H  -1.899844 -1.596801 2.452073
H  4.494967 -0.290099 1.541331
H  -3.895547 -4.200786 -0.080678
elementType: Cl F O N C H
totalener: -2061.44260703 hartree
nucrepener: 2363.20257055 hartree
electener: -4424.64517758 hartree
oneelecener: -7538.05374774 hartree
twoeener: 3113.40857016 hartree
cpcmener: -0.02851093 hartree
kineticenergy: 2055.85771449 hartree
xcener: -143.919181441906 hartree
chargesum: 0.0000000
charge: -0.078424 -0.083151 -0.198040 -0.198500 -0.196852 -0.196273 -0.310820 0.118842 -0.344995 -0.407881 0.111284 -0.131096 -0.026429 0.017526 0.005988 -0.232707 0.459554 -0.120129 -0.146298 0.063754 0.088894 0.283388 0.062720 0.088368 0.129189 0.131097 0.130831 0.123800 0.139962 0.123084 0.143975 0.170359 0.118503 0.160476
qa: -0.0784 -0.0832 -0.1980 -0.1985 -0.1969 -0.1963 -0.3108 0.1188 -0.3450 -0.4079 0.1113 -0.1311 -0.0264 0.0175 0.0060 -0.2327 0.4596 -0.1201 -0.1463 0.0638 0.0889 0.2834 0.0627 0.0884 0.1292 0.1311 0.1308 0.1238 0.1400 0.1231 0.1440 0.1704 0.1185 0.1605
va: 1.2442 1.2202 1.1029 1.0977 1.0845 1.0913 2.0672 3.3545 2.8789 3.0255 3.7217 3.9204 3.9063 3.4739 3.9811 3.9659 4.3220 4.0435 4.0391 4.0556 3.8813 4.1250 4.0505 1.0644 1.0111 0.9984 0.9982 1.0038 1.0200 1.0205 1.0050 0.9951 0.9858 0.9955
dispcorr: -0.019565534 hartree
energy: -2061.462172564991
dipole: -7.56338 9.25020 1.68682 -18.14690 17.32354 -0.82336 4.22908 -3.82958 0.39950
magnitude: 1.91908 au
magnitude: 4.87792 debye
