program: Orca
programVersion: 4.2.1
elementType: Cl Cl F F F F O N N N C C C C C C C C C C C C C H H H H H H H H H H H
charge: 0
multiplicity: 1
keywords: wb97x-d3
keywords: def2-TZVPP
keywords: def2/J RIJCOSX GRIDX6 NOFINALGRIDX
keywords: grid4 nofinalgrid
keywords: scfconv7
keywords: smallprint printgap noloewdin
keywords: NOSOSCF
formula: C13H11Cl2F4N3O
InChI: InChI=1/C13H11Cl2F4N3O/c14-9-1-2-10(11(15)3-9)8(4-22-7-20-6-21-22)5-23-13(18,19)12(16)17/h1-3,6-8,12H,4-5H2
34 atoms
Cl -1.267345 0.578351 -2.778549
Cl -4.727093 3.108109 0.409214
F  4.038682 1.441924 0.163073
F  3.559023 0.014312 1.711096
F  5.022676 -0.598114 -1.416059
F  4.537177 -2.030812 0.161475
O  2.581001 -0.187289 -0.284531
N  -0.948872 -2.280283 0.787908
N  -1.804954 -2.262905 1.810277
N  -2.592071 -3.547387 0.155909
C  0.191941 -0.331595 -0.201175
C  0.261454 -1.489149 0.800437
C  1.39548 0.5921 -0.064567
C  -1.057569 0.50485 -0.064518
C  -1.772632 0.969268 -1.166689
C  -1.520739 0.888767 1.192195
C  3.695479 0.145157 0.365186
C  -2.901296 1.764874 -1.036698
C  -2.640393 1.684196 1.356806
C  -1.430928 -3.046504 -0.192655
C  -3.324685 2.114259 0.232742
C  4.856897 -0.740429 -0.082907
C  -2.77148 -3.038444 1.389542
H  0.219958 -0.766014 -1.202955
H  1.103192 -2.135179 0.555954
H  0.4056 -1.146117 1.823473
H  1.347485 1.381919 -0.816612
H  1.400667 1.063188 0.921692
H  -0.997179 0.562439 2.080775
H  -3.435366 2.105612 -1.912661
H  -2.96994 1.959576 2.348802
H  -0.909145 -3.215626 -1.121919
H  5.786162 -0.489472 0.431218
H  -3.63948 -3.244919 1.996239
elementType: Cl F O N C H
totalener: -2061.44119347 hartree
nucrepener: 2310.20651439 hartree
electener: -4371.64770786 hartree
oneelecener: -7431.95677931 hartree
twoeener: 3060.30907144 hartree
cpcmener: -0.02709019 hartree
kineticenergy: 2055.85207514 hartree
xcener: -143.916843503666 hartree
chargesum: -0.0000000
charge: -0.079257 -0.083199 -0.198245 -0.204219 -0.196488 -0.197759 -0.302727 0.120216 -0.349591 -0.409974 0.078159 -0.131857 -0.043199 0.040988 -0.002975 -0.200085 0.452592 -0.118594 -0.149946 0.060844 0.087412 0.286219 0.068429 0.088456 0.135940 0.121473 0.126821 0.126166 0.142384 0.124119 0.146569 0.173732 0.124852 0.162746
qa: -0.0793 -0.0832 -0.1982 -0.2042 -0.1965 -0.1978 -0.3027 0.1202 -0.3496 -0.4100 0.0782 -0.1319 -0.0432 0.0410 -0.0030 -0.2001 0.4526 -0.1186 -0.1499 0.0608 0.0874 0.2862 0.0684 0.0885 0.1359 0.1215 0.1268 0.1262 0.1424 0.1241 0.1466 0.1737 0.1249 0.1627
va: 1.2451 1.2204 1.1037 1.0906 1.0908 1.0886 2.0844 3.3763 2.8729 3.0361 3.7299 3.8746 3.9123 3.5024 3.9959 3.9624 4.3204 4.0330 4.0390 4.0555 3.8759 4.1472 4.0339 1.0423 1.0118 1.0080 1.0077 1.0035 1.0107 1.0199 1.0039 0.9941 0.9823 0.9940
dispcorr: -0.018455498 hartree
energy: -2061.459648972244
dipole: -9.36079 10.85824 1.49744 -7.46674 8.35797 0.89123 7.43422 -6.95013 0.48409
magnitude: 1.80858 au
magnitude: 4.59706 debye
