program: Orca
programVersion: 4.2.1
elementType: Cl Cl F F F F O N N N C C C C C C C C C C C C C H H H H H H H H H H H
charge: 0
multiplicity: 1
keywords: wb97x-d3
keywords: def2-TZVPP
keywords: def2/J RIJCOSX GRIDX6 NOFINALGRIDX
keywords: grid4 nofinalgrid
keywords: scfconv7
keywords: smallprint printgap noloewdin
keywords: NOSOSCF
formula: C13H11Cl2F4N3O
InChI: InChI=1/C13H11Cl2F4N3O/c14-9-1-2-10(11(15)3-9)8(4-22-7-20-6-21-22)5-23-13(18,19)12(16)17/h1-3,6-8,12H,4-5H2
34 atoms
Cl -1.464024 0.868588 -3.094176
Cl -2.785878 3.518746 1.354112
F  2.552398 -0.23121 1.523731
F  3.955369 -1.239981 0.232971
F  4.706057 1.274749 0.93768
F  2.872334 2.095921 0.080026
O  2.089565 -0.396711 -0.657392
N  -1.59951 -2.766487 -0.103173
N  -0.884555 -3.37755 0.844515
N  -2.969275 -2.998217 1.563887
C  -0.057815 -1.185141 -1.264663
C  -1.012591 -2.382689 -1.363696
C  1.258295 -1.564518 -0.601439
C  -0.73077 0.000919 -0.620299
C  -1.391768 0.976281 -1.363653
C  -0.75425 0.149532 0.764723
C  3.042853 -0.233556 0.258622
C  -2.024014 2.061035 -0.77436
C  -1.382297 1.213936 1.386041
C  -2.837399 -2.540365 0.340857
C  -2.007943 2.169508 0.604297
C  3.764233 1.085927 -0.013787
C  -1.745747 -3.496822 1.824055
H  0.184211 -0.938855 -2.300974
H  -1.830003 -2.138689 -2.04086
H  -0.494685 -3.245445 -1.783512
H  1.12734 -1.916097 0.421713
H  1.728069 -2.370321 -1.169585
H  -0.271782 -0.584602 1.395719
H  -2.517842 2.805445 -1.383387
H  -1.375906 1.293151 2.464145
H  -3.595557 -2.054786 -0.253554
H  4.232816 1.101857 -0.998429
H  -1.481643 -3.965075 2.759606
elementType: Cl F O N C H
totalener: -2061.44256478 hartree
nucrepener: 2381.33309343 hartree
electener: -4442.77565821 hartree
oneelecener: -7574.77375526 hartree
twoeener: 3131.99809706 hartree
cpcmener: -0.02698018 hartree
kineticenergy: 2055.85089752 hartree
xcener: -143.919122404192 hartree
chargesum: -0.0000000
charge: -0.082389 -0.084365 -0.200074 -0.200868 -0.198944 -0.196534 -0.294859 0.133372 -0.376967 -0.401926 0.071221 -0.101185 -0.066981 0.084525 -0.016926 -0.212307 0.464960 -0.129078 -0.148475 0.059517 0.087968 0.282715 0.079153 0.081677 0.124600 0.131056 0.120259 0.134149 0.135455 0.123787 0.146203 0.171349 0.117816 0.162099
qa: -0.0824 -0.0844 -0.2001 -0.2009 -0.1989 -0.1965 -0.2949 0.1334 -0.3770 -0.4019 0.0712 -0.1012 -0.0670 0.0845 -0.0169 -0.2123 0.4650 -0.1291 -0.1485 0.0595 0.0880 0.2827 0.0792 0.0817 0.1246 0.1311 0.1203 0.1341 0.1355 0.1238 0.1462 0.1713 0.1178 0.1621
va: 1.2462 1.2190 1.0957 1.0981 1.0875 1.0877 2.0765 3.3259 2.8394 3.0262 3.7907 3.9219 3.9006 3.4078 3.9797 3.9135 4.3051 4.0608 4.0723 4.0577 3.8810 4.1393 4.0239 1.0458 1.0055 1.0078 1.0247 1.0053 1.0129 1.0203 1.0040 0.9944 0.9852 0.9944
dispcorr: -0.019638965 hartree
energy: -2061.462203743372
dipole: -11.36539 11.38117 0.01577 -18.97690 18.18673 -0.79017 -2.94246 0.84502 -2.09744
magnitude: 2.24140 au
magnitude: 5.69718 debye
