program: Orca
programVersion: 4.2.1
elementType: Cl Cl F F F F O N N N C C C C C C C C C C C C C H H H H H H H H H H H
charge: 0
multiplicity: 1
keywords: wb97x-d3
keywords: def2-TZVPP
keywords: def2/J RIJCOSX GRIDX6 NOFINALGRIDX
keywords: grid4 nofinalgrid
keywords: scfconv7
keywords: smallprint printgap noloewdin
keywords: NOSOSCF
formula: C13H11Cl2F4N3O
InChI: InChI=1/C13H11Cl2F4N3O/c14-9-1-2-10(11(15)3-9)8(4-22-7-20-6-21-22)5-23-13(18,19)12(16)17/h1-3,6-8,12H,4-5H2
34 atoms
Cl -1.688462 0.782158 -2.989358
Cl -2.861208 3.397958 1.524119
F  3.144827 -0.873576 1.389068
F  4.232783 -1.05144 -0.468348
F  2.885016 1.818838 1.031946
F  3.960671 1.682124 -0.867522
O  2.134182 -0.2950 -0.522138
N  -1.517495 -2.701811 -0.169177
N  -0.835473 -3.310362 0.803703
N  -2.936718 -2.905593 1.459823
C  0.037874 -1.09861 -1.272378
C  -0.892012 -2.313932 -1.410337
C  1.354138 -1.493194 -0.619239
C  -0.667695 0.04023 -0.579064
C  -1.479678 0.934839 -1.272751
C  -0.578595 0.219273 0.799995
C  3.278486 -0.314384 0.158866
C  -2.158143 1.968845 -0.644423
C  -1.246097 1.235381 1.459803
C  -2.764786 -2.459251 0.238376
C  -2.02835 2.109646 0.724926
C  3.807404 1.1070 0.345004
C  -1.72723 -3.41548 1.757228
H  0.274427 -0.800592 -2.296555
H  -1.689597 -2.087166 -2.11612
H  -0.345093 -3.16901 -1.808965
H  1.209648 -1.945914 0.361838
H  1.858308 -2.224907 -1.255308
H  0.025955 -0.451738 1.395093
H  -2.77332 2.648812 -1.21717
H  -1.148213 1.340617 2.531141
H  -3.501058 -1.972881 -0.38247
H  4.756781 1.125496 0.882758
H  -1.494327 -3.878816 2.703528
elementType: Cl F O N C H
totalener: -2061.44213363 hartree
nucrepener: 2383.84316040 hartree
electener: -4445.28529403 hartree
oneelecener: -7579.99165967 hartree
twoeener: 3134.70636565 hartree
cpcmener: -0.02667133 hartree
kineticenergy: 2055.84593273 hartree
xcener: -143.918548439752 hartree
chargesum: 0.0000000
charge: -0.081717 -0.085005 -0.202651 -0.201042 -0.197061 -0.197702 -0.281732 0.140119 -0.373837 -0.400907 0.091098 -0.139972 -0.078322 0.048747 -0.016225 -0.176142 0.445486 -0.120835 -0.152872 0.061773 0.089402 0.282242 0.078052 0.088506 0.132440 0.131897 0.125367 0.136390 0.129807 0.123756 0.144735 0.168027 0.126756 0.161422
qa: -0.0817 -0.0850 -0.2027 -0.2010 -0.1971 -0.1977 -0.2817 0.1401 -0.3738 -0.4009 0.0911 -0.1400 -0.0783 0.0487 -0.0162 -0.1761 0.4455 -0.1208 -0.1529 0.0618 0.0894 0.2822 0.0781 0.0885 0.1324 0.1319 0.1254 0.1364 0.1298 0.1238 0.1447 0.1680 0.1268 0.1614
va: 1.2481 1.2180 1.0944 1.0978 1.0905 1.0889 2.0932 3.3077 2.8433 3.0278 3.7662 3.9220 3.8911 3.4438 3.9668 3.8966 4.3405 4.0575 4.0764 4.0583 3.8752 4.1403 4.0252 1.0373 1.0051 1.0093 1.0251 1.0037 1.0112 1.0199 1.0046 0.9955 0.9824 0.9946
dispcorr: -0.019708300 hartree
energy: -2061.461841929642
dipole: -9.77733 10.28919 0.51185 -17.78351 17.08961 -0.69390 0.00033 -1.01861 -1.01828
magnitude: 1.33431 au
magnitude: 3.39156 debye
