program: Orca
programVersion: 4.2.1
elementType: Cl Cl F F F F O N N N C C C C C C C C C C C C C H H H H H H H H H H H
charge: 0
multiplicity: 1
keywords: wb97x-d3
keywords: def2-TZVPP
keywords: def2/J RIJCOSX GRIDX6 NOFINALGRIDX
keywords: grid4 nofinalgrid
keywords: scfconv7
keywords: smallprint printgap noloewdin
keywords: NOSOSCF
formula: C13H11Cl2F4N3O
InChI: InChI=1/C13H11Cl2F4N3O/c14-9-1-2-10(11(15)3-9)8(4-22-7-20-6-21-22)5-23-13(18,19)12(16)17/h1-3,6-8,12H,4-5H2
34 atoms
Cl -1.688901 0.796348 -3.048888
Cl -3.019738 3.449098 1.393266
F  2.832543 -0.379606 1.518323
F  4.052085 -1.28813 -0.013693
F  5.027637 1.088801 0.807052
F  3.139667 2.080846 0.332112
O  2.146833 -0.292173 -0.605398
N  -1.515055 -2.66873 -0.157116
N  -0.792335 -3.357381 0.73205
N  -2.824121 -2.904072 1.561504
C  0.002742 -1.041962 -1.267597
C  -0.946319 -2.242876 -1.408313
C  1.3033 -1.44402 -0.588726
C  -0.712528 0.10854 -0.604062
C  -1.520689 0.980012 -1.331347
C  -0.659182 0.308576 0.772527
C  3.198123 -0.262199 0.222284
C  -2.231139 2.008859 -0.733937
C  -1.360027 1.323323 1.39886
C  -2.722189 -2.398563 0.359396
C  -2.142145 2.173784 0.636714
C  3.946642 1.054742 0.005242
C  -1.617442 -3.475704 1.745218
H  0.260138 -0.750327 -2.289583
H  -1.767045 -1.974135 -2.072961
H  -0.429016 -3.092061 -1.857291
H  1.143234 -1.814663 0.423777
H  1.767293 -2.254092 -1.158566
H  -0.057173 -0.344525 1.389144
H  -2.842606 2.669867 -1.331183
H  -1.295598 1.449915 2.469942
H  -3.479693 -1.841527 -0.170566
H  4.264145 1.16113 -1.035192
H  -1.341047 -4.002764 2.644835
totalener: -2061.41706689 hartree
nucrepener: 2370.05327066 hartree
electener: -4431.47033755 hartree
oneelecener: -7551.93683101 hartree
twoeener: 3120.46649346 hartree
kineticenergy: 2055.85889755 hartree
xcener: -143.919961069119 hartree
chargesum: 0.0000000
charge: -0.075038 -0.062327 -0.186059 -0.188446 -0.176818 -0.176960 -0.284998 0.133307 -0.344932 -0.321861 0.076958 -0.160887 -0.086406 0.051262 -0.026084 -0.158620 0.457701 -0.129861 -0.111842 0.043439 0.083756 0.281003 0.074687 0.081719 0.125764 0.122252 0.128530 0.116991 0.115231 0.115736 0.125842 0.142691 0.077763 0.136505
qa: -0.0750 -0.0623 -0.1861 -0.1884 -0.1768 -0.1770 -0.2850 0.1333 -0.3449 -0.3219 0.0770 -0.1609 -0.0864 0.0513 -0.0261 -0.1586 0.4577 -0.1299 -0.1118 0.0434 0.0838 0.2810 0.0747 0.0817 0.1258 0.1223 0.1285 0.1170 0.1152 0.1157 0.1258 0.1427 0.0778 0.1365
va: 1.2584 1.2421 1.1179 1.1150 1.1174 1.1145 2.0829 3.2708 2.8301 3.0581 3.7804 3.9305 3.9383 3.4647 3.9894 3.9306 4.3082 4.0704 4.0783 4.0761 3.9519 4.1861 4.0313 1.0389 1.0096 1.0120 1.0230 1.0097 1.0209 1.0225 1.0110 1.0010 0.9909 1.0000
dispcorr: -0.019541747 hartree
energy: -2061.436608639604
dipole: -11.29520 11.17851 -0.11670 -17.30635 17.01146 -0.29488 -3.01925 1.59548 -1.42377
magnitude: 1.45866 au
magnitude: 3.70762 debye
