program: Orca
programVersion: 4.2.1
elementType: Cl Cl F F F F O N N N C C C C C C C C C C C C C H H H H H H H H H H H
charge: 0
multiplicity: 1
keywords: wb97x-d3
keywords: def2-TZVPP
keywords: def2/J RIJCOSX GRIDX6 NOFINALGRIDX
keywords: grid4 nofinalgrid
keywords: scfconv7
keywords: smallprint printgap noloewdin
keywords: NOSOSCF
formula: C13H11Cl2F4N3O
InChI: InChI=1/C13H11Cl2F4N3O/c14-9-1-2-10(11(15)3-9)8(4-22-7-20-6-21-22)5-23-13(18,19)12(16)17/h1-3,6-8,12H,4-5H2
34 atoms
Cl -1.167206 0.681786 -2.89801
Cl -3.160347 3.400106 1.245873
F  4.035587 -1.168408 -0.431444
F  2.754184 0.136995 -1.571864
F  4.239573 0.733193 1.548401
F  2.922929 2.050616 0.404786
O  2.080554 -0.550289 0.451272
N  -1.649761 -2.768233 -0.001386
N  -1.147087 -3.469165 1.020077
N  -3.274193 -2.900091 1.436646
C  0.108454 -1.215301 -0.847923
C  -0.836711 -2.396564 -1.129147
C  1.267231 -1.650769 0.047612
C  -0.673731 -0.039655 -0.321298
C  -1.298649 0.8643 -1.177884
C  -0.868515 0.155901 1.043602
C  3.115109 -0.179535 -0.299461
C  -2.060821 1.924043 -0.711977
C  -1.628286 1.199619 1.539246
C  -2.917971 -2.428809 0.269544
C  -2.217192 2.08504 0.652781
C  3.806688 1.040638 0.311568
C  -2.156958 -3.526369 1.855856
H  0.524869 -0.948394 -1.820284
H  -1.506607 -2.125396 -1.944924
H  -0.273065 -3.274155 -1.449982
H  0.91596 -2.105773 0.971542
H  1.854461 -2.414877 -0.468878
H  -0.42017 -0.525706 1.753695
H  -2.523751 2.611105 -1.405661
H  -1.759844 1.321563 2.604706
H  -3.529238 -1.847916 -0.404218
H  4.655645 1.357109 -0.300977
H  -2.08558 -4.043978 2.799576
totalener: -2061.41500907 hartree
nucrepener: 2389.48701591 hartree
electener: -4450.90202498 hartree
oneelecener: -7590.98474229 hartree
twoeener: 3140.08271731 hartree
kineticenergy: 2055.86099032 hartree
xcener: -143.920248174976 hartree
chargesum: 0.0000000
charge: -0.073445 -0.064045 -0.189556 -0.198710 -0.176527 -0.176380 -0.271498 0.135063 -0.346874 -0.321820 0.047267 -0.160297 -0.053555 0.022933 -0.022344 -0.128015 0.440266 -0.126873 -0.120431 0.042847 0.085561 0.283351 0.074460 0.087637 0.126254 0.124978 0.130718 0.111400 0.117325 0.115751 0.123876 0.142709 0.082244 0.135731
qa: -0.0734 -0.0640 -0.1896 -0.1987 -0.1765 -0.1764 -0.2715 0.1351 -0.3469 -0.3218 0.0473 -0.1603 -0.0536 0.0229 -0.0223 -0.1280 0.4403 -0.1269 -0.1204 0.0428 0.0856 0.2834 0.0745 0.0876 0.1263 0.1250 0.1307 0.1114 0.1173 0.1158 0.1239 0.1427 0.0822 0.1357
va: 1.2587 1.2404 1.1153 1.0997 1.1178 1.1185 2.1100 3.2669 2.8264 3.0578 3.7407 3.9447 3.8986 3.4802 3.9925 3.9397 4.3510 4.0667 4.0862 4.0771 3.9475 4.1834 4.0290 1.0482 1.0071 1.0094 1.0275 1.0118 1.0118 1.0227 1.0119 1.0012 0.9888 1.0001
dispcorr: -0.019899481 hartree
energy: -2061.434908554532
dipole: -10.79209 11.13986 0.34777 -18.19282 17.89836 -0.29446 2.62756 -3.54237 -0.91481
magnitude: 1.02202 au
magnitude: 2.59777 debye
