program: Orca
programVersion: 4.2.1
elementType: Cl Cl F F F F O N N N C C C C C C C C C C C C C H H H H H H H H H H H
charge: 0
multiplicity: 1
keywords: wb97x-d3
keywords: def2-TZVPP
keywords: def2/J RIJCOSX GRIDX6 NOFINALGRIDX
keywords: grid4 nofinalgrid
keywords: scfconv7
keywords: smallprint printgap noloewdin
keywords: NOSOSCF
formula: C13H11Cl2F4N3O
InChI: InChI=1/C13H11Cl2F4N3O/c14-9-1-2-10(11(15)3-9)8(4-22-7-20-6-21-22)5-23-13(18,19)12(16)17/h1-3,6-8,12H,4-5H2
34 atoms
Cl -1.394023 1.110283 -3.086785
Cl -5.078151 2.820389 0.381486
F  3.83576 0.911806 1.3162
F  3.162165 -1.036837 1.953138
F  5.030089 -0.225142 -0.900057
F  4.324709 -2.188375 -0.245661
O  2.444779 -0.232072 -0.003507
N  -0.611794 -2.104108 0.162899
N  -1.937917 -2.195063 0.29328
N  -0.914666 -3.175721 2.030466
C  0.201227 0.09893 -0.669002
C  -0.01511 -1.399214 -0.942176
C  1.218899 0.35761 0.433257
C  -1.105337 0.801939 -0.401169
C  -1.899601 1.286093 -1.439083
C  -1.604601 0.954178 0.889261
C  3.468065 -0.303688 0.849887
C  -3.116649 1.907325 -1.213035
C  -2.815563 1.570352 1.147564
C  -0.015223 -2.695614 1.210748
C  -3.565975 2.047603 0.087791
C  4.674317 -0.955618 0.171663
C  -2.073477 -2.844395 1.423758
H  0.630986 0.506628 -1.587829
H  -0.671206 -1.521058 -1.80199
H  0.934628 -1.875654 -1.184055
H  1.342352 1.434166 0.574032
H  0.910773 -0.078783 1.38645
H  -1.046432 0.571252 1.733134
H  -3.705081 2.272591 -2.042315
H  -3.17331 1.668858 2.162377
H  1.056876 -2.757191 1.323366
H  5.521618 -1.031622 0.858555
H  -3.044331 -3.093648 1.822087
totalener: -2061.41593528 hartree
nucrepener: 2333.43468357 hartree
electener: -4394.85061885 hartree
oneelecener: -7478.43578200 hartree
twoeener: 3083.58516315 hartree
kineticenergy: 2055.85532627 hartree
xcener: -143.917932304853 hartree
chargesum: 0.0000000
charge: -0.071111 -0.065301 -0.185366 -0.195509 -0.174257 -0.181712 -0.270672 0.107559 -0.305894 -0.325762 0.136340 -0.137573 -0.160675 0.018059 -0.011099 -0.153150 0.435748 -0.134963 -0.142158 0.016575 0.094749 0.286150 0.064280 0.088588 0.131826 0.131172 0.147114 0.117091 0.121955 0.116436 0.124445 0.153017 0.089772 0.134325
qa: -0.0711 -0.0653 -0.1854 -0.1955 -0.1743 -0.1817 -0.2707 0.1076 -0.3059 -0.3258 0.1363 -0.1376 -0.1607 0.0181 -0.0111 -0.1531 0.4357 -0.1350 -0.1422 0.0166 0.0947 0.2861 0.0643 0.0886 0.1318 0.1312 0.1471 0.1171 0.1220 0.1164 0.1244 0.1530 0.0898 0.1343
va: 1.2603 1.2395 1.1223 1.0999 1.1216 1.1099 2.0914 3.3090 2.8392 3.0655 3.7003 3.8807 3.9641 3.5366 4.0540 3.9553 4.3284 4.0805 4.0915 4.0536 3.9432 4.1868 4.0283 1.0430 1.0190 1.0144 1.0025 0.9925 1.0056 1.0215 1.0123 1.0158 0.9888 1.0009
dispcorr: -0.019329603 hartree
energy: -2061.435264885012
dipole: -7.51441 8.26003 0.74562 -6.51105 7.04678 0.53572 4.70880 -4.77647 -0.06767
magnitude: 0.92062 au
magnitude: 2.34002 debye
