program: Orca
programVersion: 4.2.1
elementType: Cl Cl F F F F O N N N C C C C C C C C C C C C C H H H H H H H H H H H
charge: 0
multiplicity: 1
keywords: wb97x-d3
keywords: def2-TZVPP
keywords: def2/J RIJCOSX GRIDX6 NOFINALGRIDX
keywords: grid4 nofinalgrid
keywords: scfconv7
keywords: smallprint printgap noloewdin
keywords: NOSOSCF
formula: C13H11Cl2F4N3O
InChI: InChI=1/C13H11Cl2F4N3O/c14-9-1-2-10(11(15)3-9)8(4-22-7-20-6-21-22)5-23-13(18,19)12(16)17/h1-3,6-8,12H,4-5H2
34 atoms
Cl -2.636963 0.441047 -2.684608
Cl -2.345306 5.120357 -0.137929
F  3.065644 -2.034865 -0.151936
F  3.350399 -0.120271 -1.105367
F  2.999898 -0.834761 2.312008
F  3.291589 1.113367 1.369609
O  1.490204 -0.469432 0.078228
N  -0.656346 -2.801029 0.831566
N  -1.297889 -3.673936 0.050588
N  0.424838 -4.667752 1.085037
C  -0.814731 -0.710556 -0.45904
C  -1.057698 -1.419437 0.879259
C  0.609679 -0.897722 -0.962579
C  -1.206996 0.745681 -0.384541
C  -2.026871 1.345992 -1.340071
C  -0.739083 1.566981 0.640942
C  2.797358 -0.713124 -0.021854
C  -2.382745 2.684774 -1.273618
C  -1.076667 2.905115 0.731368
C  0.375537 -3.40841 1.435696
C  -1.905227 3.456722 -0.230697
C  3.512714 -0.206609 1.231786
C  -0.617337 -4.779516 0.236618
H  -1.448575 -1.210986 -1.193298
H  -0.508586 -0.953489 1.695449
H  -2.117784 -1.36777 1.127551
H  0.782942 -1.948025 -1.207518
H  0.767094 -0.303311 -1.865416
H  -0.077402 1.16128 1.393556
H  -3.023563 3.116034 -2.029152
H  -0.694098 3.512104 1.539453
H  1.051144 -2.898273 2.104877
H  4.588142 -0.394066 1.182517
H  -0.884805 -5.701504 -0.255229
totalener: -2061.41753410 hartree
nucrepener: 2352.96992693 hartree
electener: -4414.38746103 hartree
oneelecener: -7517.54666550 hartree
twoeener: 3103.15920447 hartree
kineticenergy: 2055.86127519 hartree
xcener: -143.918406840595 hartree
chargesum: 0.0000000
charge: -0.064146 -0.063785 -0.183512 -0.185398 -0.189343 -0.179706 -0.287103 0.095538 -0.319305 -0.327308 0.138115 -0.152569 -0.073639 -0.050421 -0.009407 -0.127305 0.425660 -0.133620 -0.160554 0.049069 0.094021 0.282017 0.064427 0.110973 0.116548 0.125334 0.138167 0.133418 0.112169 0.116483 0.125905 0.139203 0.105313 0.134761
qa: -0.0641 -0.0638 -0.1835 -0.1854 -0.1893 -0.1797 -0.2871 0.0955 -0.3193 -0.3273 0.1381 -0.1526 -0.0736 -0.0504 -0.0094 -0.1273 0.4257 -0.1336 -0.1606 0.0491 0.0940 0.2820 0.0644 0.1110 0.1165 0.1253 0.1382 0.1334 0.1122 0.1165 0.1259 0.1392 0.1053 0.1348
va: 1.2617 1.2410 1.1147 1.1217 1.1004 1.1165 2.0803 3.3026 2.8469 3.0629 3.6195 3.9562 3.8990 3.5651 4.0361 3.9866 4.3648 4.0502 4.0900 4.0605 3.9289 4.1493 4.0428 1.0566 1.0005 1.0098 0.9929 1.0065 1.0293 1.0223 1.0129 1.0159 0.9899 1.0007
dispcorr: -0.019133987 hartree
energy: -2061.436668084521
dipole: -6.66088 6.89584 0.23496 -12.32605 13.05751 0.73147 4.07261 -3.88918 0.18344
magnitude: 0.78987 au
magnitude: 2.00770 debye
