program: Orca
programVersion: 4.2.1
elementType: Cl Cl F F F F O N N N C C C C C C C C C C C C C H H H H H H H H H H H
charge: 0
multiplicity: 1
keywords: wb97x-d3
keywords: def2-TZVPP
keywords: def2/J RIJCOSX GRIDX6 NOFINALGRIDX
keywords: grid4 nofinalgrid
keywords: scfconv7
keywords: smallprint printgap noloewdin
keywords: NOSOSCF
formula: C13H11Cl2F4N3O
InChI: InChI=1/C13H11Cl2F4N3O/c14-9-1-2-10(11(15)3-9)8(4-22-7-20-6-21-22)5-23-13(18,19)12(16)17/h1-3,6-8,12H,4-5H2
34 atoms
Cl -2.037943 0.133636 -2.912144
Cl -3.380332 3.759364 0.769821
F  3.532804 -1.267348 0.035937
F  4.243114 0.249441 -1.324583
F  5.133302 0.585083 1.227322
F  3.075625 0.641099 1.962369
O  2.15026 0.382159 -0.56587
N  -0.881119 -2.422238 0.662604
N  -1.665229 -3.13047 -0.152128
N  -2.609792 -2.94073 1.87145
C  0.113343 -0.856106 -0.936036
C  0.35824 -1.868316 0.185534
C  1.419889 -0.365149 -1.543517
C  -0.767578 0.293957 -0.511665
C  -1.769722 0.800199 -1.337007
C  -0.591058 0.926407 0.717107
C  3.410522 0.04463 -0.278035
C  -2.578421 1.859787 -0.954533
C  -1.380263 1.986157 1.124964
C  -1.46217 -2.313658 1.86532
C  -2.379039 2.443941 0.282516
C  3.86978 0.905116 0.90065
C  -2.688436 -3.421899 0.614194
H  -0.392069 -1.406703 -1.732806
H  0.982322 -2.68134 -0.189061
H  0.879356 -1.43426 1.038311
H  1.999312 -1.210175 -1.923157
H  1.212955 0.299543 -2.383281
H  0.196938 0.597404 1.380919
H  -3.352057 2.221656 -1.616299
H  -1.217732 2.452112 2.086368
H  -1.017329 -1.779325 2.690863
H  3.810896 1.970149 0.664325
H  -3.5211 -4.005074 0.253735
totalener: -2061.41577276 hartree
nucrepener: 2355.83196456 hartree
electener: -4417.24773732 hartree
oneelecener: -7523.17055330 hartree
twoeener: 3105.92281598 hartree
kineticenergy: 2055.86153081 hartree
xcener: -143.919343635394 hartree
chargesum: -0.0000000
charge: -0.065814 -0.064052 -0.188828 -0.182364 -0.171709 -0.186695 -0.292283 0.123872 -0.315977 -0.332085 0.094053 -0.196260 -0.048644 0.077365 -0.020945 -0.205065 0.450482 -0.121680 -0.130461 0.058943 0.079911 0.281003 0.066990 0.100478 0.128590 0.111812 0.120811 0.117042 0.117396 0.114939 0.124915 0.135562 0.084773 0.133924
qa: -0.0658 -0.0641 -0.1888 -0.1824 -0.1717 -0.1867 -0.2923 0.1239 -0.3160 -0.3321 0.0941 -0.1963 -0.0486 0.0774 -0.0209 -0.2051 0.4505 -0.1217 -0.1305 0.0589 0.0799 0.2810 0.0670 0.1005 0.1286 0.1118 0.1208 0.1170 0.1174 0.1149 0.1249 0.1356 0.0848 0.1339
va: 1.2607 1.2405 1.1076 1.1256 1.1255 1.0965 2.0735 3.3123 2.8580 3.0657 3.6802 3.9523 3.9163 3.4929 4.0293 3.9887 4.3180 4.0420 4.0779 4.0679 3.9479 4.1547 4.0512 1.0550 1.0088 1.0170 1.0035 1.0110 1.0196 1.0224 1.0120 1.0034 0.9922 1.0003
dispcorr: -0.019429325 hartree
energy: -2061.435202085854
dipole: -8.13967 8.91588 0.77622 -10.43986 11.13968 0.69982 1.51782 -1.91723 -0.39940
magnitude: 1.11883 au
magnitude: 2.84385 debye
