program: Orca
programVersion: 4.2.1
elementType: Cl Cl F F F F O N N N C C C C C C C C C C C C C H H H H H H H H H H H
charge: 0
multiplicity: 1
keywords: wb97x-d3
keywords: def2-TZVPP
keywords: def2/J RIJCOSX GRIDX6 NOFINALGRIDX
keywords: grid4 nofinalgrid
keywords: scfconv7
keywords: smallprint printgap noloewdin
keywords: NOSOSCF
formula: C13H11Cl2F4N3O
InChI: InChI=1/C13H11Cl2F4N3O/c14-9-1-2-10(11(15)3-9)8(4-22-7-20-6-21-22)5-23-13(18,19)12(16)17/h1-3,6-8,12H,4-5H2
34 atoms
Cl -2.546325 -0.884005 -2.178666
Cl -3.205165 3.709469 0.4478
F  4.349559 -0.413936 -0.938803
F  3.19363 1.399056 -0.745276
F  3.242051 1.110373 2.022803
F  5.200367 1.245051 1.061977
O  2.353375 -0.506766 0.051437
N  -1.258458 -2.641438 0.704563
N  -1.709233 -3.651663 -0.043748
N  -3.350563 -2.84487 1.252559
C  0.150217 -1.182915 -0.672015
C  0.077925 -2.139592 0.526357
C  1.586012 -0.904631 -1.090099
C  -0.683255 0.051932 -0.421846
C  -1.911909 0.26134 -1.048728
C  -0.279024 1.016972 0.501604
C  3.460937 0.223827 -0.14069
C  -2.691037 1.379995 -0.79034
C  -1.036472 2.140965 0.776586
C  -2.255227 -2.162433 1.463661
C  -2.243487 2.317384 0.12125
C  4.117021 0.466609 1.220876
C  -2.964923 -3.740489 0.320048
H  -0.27386 -1.723888 -1.52092
H  0.735734 -2.99621 0.375573
H  0.384176 -1.643466 1.447218
H  2.022132 -1.817753 -1.503851
H  1.599757 -0.137041 -1.865967
H  0.653188 0.894882 1.033272
H  -3.638522 1.509583 -1.293138
H  -0.689292 2.871246 1.493568
H  -2.132787 -1.333132 2.143966
H  4.410195 -0.474358 1.693279
H  -3.626425 -4.483825 -0.096061
totalener: -2061.41471792 hartree
nucrepener: 2354.72583519 hartree
electener: -4416.14055311 hartree
oneelecener: -7521.01794537 hartree
twoeener: 3104.87739227 hartree
kineticenergy: 2055.85726972 hartree
xcener: -143.917965266748 hartree
chargesum: 0.0000000
charge: -0.057512 -0.061624 -0.185077 -0.179272 -0.182602 -0.170901 -0.309631 0.116516 -0.310408 -0.321122 0.102127 -0.134447 -0.072701 -0.099171 0.045027 -0.152434 0.446419 -0.114865 -0.164702 0.029581 0.095303 0.282723 0.063220 0.100569 0.117662 0.121175 0.125754 0.129688 0.140812 0.117113 0.127121 0.143385 0.081882 0.130391
qa: -0.0575 -0.0616 -0.1851 -0.1793 -0.1826 -0.1709 -0.3096 0.1165 -0.3104 -0.3211 0.1021 -0.1344 -0.0727 -0.0992 0.0450 -0.1524 0.4464 -0.1149 -0.1647 0.0296 0.0953 0.2827 0.0632 0.1006 0.1177 0.1212 0.1258 0.1297 0.1408 0.1171 0.1271 0.1434 0.0819 0.1304
va: 1.2704 1.2431 1.1190 1.1262 1.1015 1.1260 2.0581 3.3156 2.8550 3.0548 3.7012 3.9309 3.9153 3.5548 3.9583 3.9512 4.3326 4.0440 4.0934 4.0860 3.9318 4.1636 4.0540 1.0574 1.0177 1.0023 0.9950 0.9996 1.0203 1.0229 1.0129 1.0012 0.9913 1.0020
dispcorr: -0.019815060 hartree
energy: -2061.434532978938
dipole: -7.53035 8.55540 1.02505 -15.60477 15.36748 -0.23730 2.78315 -2.67126 0.11189
magnitude: 1.05809 au
magnitude: 2.68945 debye
