program: Orca
programVersion: 4.2.1
elementType: Cl Cl F F F F O N N N C C C C C C C C C C C C C H H H H H H H H H H H
charge: 0
multiplicity: 1
keywords: wb97x-d3
keywords: def2-TZVPP
keywords: def2/J RIJCOSX GRIDX6 NOFINALGRIDX
keywords: grid4 nofinalgrid
keywords: scfconv7
keywords: smallprint printgap noloewdin
keywords: NOSOSCF
formula: C13H11Cl2F4N3O
InChI: InChI=1/C13H11Cl2F4N3O/c14-9-1-2-10(11(15)3-9)8(4-22-7-20-6-21-22)5-23-13(18,19)12(16)17/h1-3,6-8,12H,4-5H2
34 atoms
Cl -0.99737 0.909377 -2.860102
Cl -4.971431 2.698035 0.228148
F  3.276452 1.004896 -0.682961
F  3.893142 0.980533 1.383563
F  4.399802 -1.474784 -1.068001
F  5.05144 -1.497084 1.018545
O  2.483817 -0.593215 0.668656
N  -0.897765 -2.263269 0.308029
N  -0.579632 -2.518307 1.580653
N  -2.73211 -3.014292 1.201773
C  0.307241 -0.174848 -0.295009
C  0.043304 -1.659622 -0.599685
C  1.219744 0.030204 0.913786
C  -0.995797 0.570826 -0.161324
C  -1.664351 1.087827 -1.270477
C  -1.624488 0.723409 1.072889
C  3.530788 0.169033 0.359605
C  -2.880287 1.743729 -1.164301
C  -2.839431 1.371074 1.210059
C  -2.189084 -2.556235 0.102907
C  -3.459953 1.883841 0.084388
C  4.732019 -0.700048 -0.016186
C  -1.708104 -2.969764 2.076028
H  0.83959 0.219402 -1.162991
H  -0.372585 -1.749482 -1.60317
H  0.97394 -2.226118 -0.578452
H  1.326169 1.097276 1.12244
H  0.830063 -0.454818 1.806185
H  -1.165482 0.314722 1.963075
H  -3.366968 2.137321 -2.045152
H  -3.300336 1.467314 2.18261
H  -2.679319 -2.424152 -0.849614
H  5.59577 -0.083655 -0.280072
H  -1.791207 -3.285101 3.10436
totalener: -2061.41634831 hartree
nucrepener: 2340.53432247 hartree
electener: -4401.95067078 hartree
oneelecener: -7492.85450856 hartree
twoeener: 3090.90383778 hartree
kineticenergy: 2055.85668410 hartree
xcener: -143.919261529716 hartree
chargesum: -0.0000000
charge: -0.067651 -0.061317 -0.197787 -0.188018 -0.183709 -0.173768 -0.282552 0.135892 -0.343511 -0.321669 0.076172 -0.134742 -0.054591 -0.013902 -0.013502 -0.160101 0.434726 -0.131813 -0.127004 0.044117 0.091488 0.283981 0.066444 0.084271 0.120656 0.129346 0.135390 0.123933 0.124468 0.117397 0.126484 0.140147 0.085893 0.134830
qa: -0.0677 -0.0613 -0.1978 -0.1880 -0.1837 -0.1738 -0.2826 0.1359 -0.3435 -0.3217 0.0762 -0.1347 -0.0546 -0.0139 -0.0135 -0.1601 0.4347 -0.1318 -0.1270 0.0441 0.0915 0.2840 0.0664 0.0843 0.1207 0.1293 0.1354 0.1239 0.1245 0.1174 0.1265 0.1401 0.0859 0.1348
va: 1.2643 1.2431 1.0995 1.1181 1.1097 1.1218 2.1028 3.2700 2.8097 3.0577 3.7325 3.8864 3.8660 3.5310 4.0095 3.9352 4.3522 4.0669 4.0947 4.0719 3.9466 4.1796 4.0301 1.0561 1.0060 1.0261 1.0074 1.0298 1.0157 1.0223 1.0122 1.0024 0.9891 1.0004
dispcorr: -0.019394270 hartree
energy: -2061.435742582290
dipole: -10.20104 10.48580 0.28476 -8.44218 9.07409 0.63191 6.34120 -6.80911 -0.46791
magnitude: 0.83626 au
magnitude: 2.12561 debye
