program: Orca
programVersion: 5.0.2
elementType: N C C C C C C C C C C C C C C C C C C C C C H H H H H H H H H H H H H H H H H H H H H H H H H
charge: 0
multiplicity: 1
keywords: wb97x-d3
keywords: def2-TZVPP
keywords: def2/J RIJCOSX
keywords: DEFGRID2
keywords: scfconv7
keywords: smallprint printgap noloewdin
keywords: NOSOSCF
formula: C21H25N
InChI: InChI=1/C21H25N/c1-21(2,3)15-8-5-9-16-22(4)17-19-13-10-12-18-11-6-7-14-20(18)19/h5-7,9-14H,16-17H2,1-4H3
47 atoms
N  -2.902769 -1.70766 0.565682
C  -2.370464 -0.676167 1.450254
C  -2.413078 0.705235 0.84398
C  -1.248371 1.513667 0.679272
C  -1.376373 2.790914 0.060186
C  4.244499 -1.663772 -0.725336
C  -2.193857 -1.794243 -0.707206
C  -3.627993 1.200535 0.434567
C  0.04827 1.114275 1.096193
C  -2.931837 -2.980004 1.262212
C  -2.64707 3.246729 -0.353251
C  -3.753319 2.468126 -0.160238
C  -0.225821 3.592012 -0.13948
C  4.853227 -0.270799 -0.52964
C  4.846936 -2.322502 -1.970768
C  4.52512 -2.531537 0.506125
C  -0.720533 -2.049638 -0.610141
C  1.14157 1.909117 0.88835
C  1.008171 3.162829 0.258722
C  2.795236 -1.526753 -0.894435
C  0.194136 -1.226422 -1.129963
C  1.598044 -1.414298 -1.008622
H  -1.360335 -0.926042 1.794405
H  -2.990282 -0.675847 2.351271
H  -2.663342 -2.598263 -1.281943
H  -2.363314 -0.874913 -1.272775
H  -4.518719 0.600504 0.569981
H  0.190916 0.16136 1.584252
H  -3.588601 -2.910177 2.130593
H  -1.952431 -3.321198 1.623668
H  -3.334241 -3.753399 0.606996
H  -2.729902 4.221612 -0.818296
H  -4.730067 2.819181 -0.466581
H  -0.344286 4.557068 -0.617398
H  4.668152 0.367374 -1.394244
H  5.933204 -0.352184 -0.394741
H  4.438863 0.222408 0.350969
H  4.667261 -1.722726 -2.86358
H  5.926167 -2.429547 -1.848192
H  4.426756 -3.314804 -2.138235
H  4.096158 -3.528026 0.394957
H  5.601841 -2.641781 0.646163
H  4.11158 -2.082789 1.409983
H  -0.39227 -2.937127 -0.07785
H  2.118561 1.570379 1.208875
H  1.88112 3.78164 0.097868
H  -0.129683 -0.33715 -1.664434
elementType: N C H
totalener: -870.02806960 hartree
nucrepener: 1707.82420611 hartree
electener: -2577.85227571 hartree
oneelecener: -4568.43197628 hartree
twoeener: 1990.57970056 hartree
cpcmener: -0.02131426 hartree
kineticenergy: 865.86979340 hartree
xcener: -88.998624806744 hartree
chargesum: -0.0000000
charge: -0.206636 -0.092388 0.120774 -0.057853 -0.031182 0.083072 -0.067909 -0.204765 -0.261866 -0.207621 -0.145590 -0.143809 -0.088866 -0.303185 -0.291184 -0.290802 -0.106842 -0.135229 -0.176258 -0.314125 -0.265134 0.248384 0.109467 0.117849 0.109771 0.097632 0.126655 0.151986 0.100812 0.081835 0.103052 0.144644 0.157823 0.142706 0.102946 0.100454 0.097336 0.100683 0.097932 0.101256 0.100633 0.097247 0.100258 0.132035 0.170095 0.158593 0.135312
qa: -0.2066 -0.0924 0.1208 -0.0579 -0.0312 0.0831 -0.0679 -0.2048 -0.2619 -0.2076 -0.1456 -0.1438 -0.0889 -0.3032 -0.2912 -0.2908 -0.1068 -0.1352 -0.1763 -0.3141 -0.2651 0.2484 0.1095 0.1178 0.1098 0.0976 0.1267 0.1520 0.1008 0.0818 0.1031 0.1446 0.1578 0.1427 0.1029 0.1005 0.0973 0.1007 0.0979 0.1013 0.1006 0.0972 0.1003 0.1320 0.1701 0.1586 0.1353
va: 2.8547 3.8402 3.4472 3.6851 3.8683 4.0073 3.9777 3.9464 3.8973 3.9539 3.9219 3.9036 3.8659 3.9002 3.8932 3.8915 3.7284 3.8664 3.9429 4.1064 3.9683 3.5976 0.9999 0.9955 0.9970 1.0014 1.0278 1.0102 0.9951 0.9941 0.9961 1.0046 0.9904 1.0049 1.0047 1.0044 1.0064 1.0056 1.0030 1.0055 1.0058 1.0034 1.0056 1.0095 0.9859 0.9907 0.9981
dispcorr: -0.023052091 hartree
energy: -870.051121695587
dipole: 16.10634 -15.60888 0.49745 -15.02572 14.67024 -0.35547 0.03115 0.23942 0.27057
magnitude: 0.66860 au
magnitude: 1.69945 debye
