program: Orca
programVersion: 5.0.2
elementType: N C C C C C C C C C C C C C C C C C C C C C H H H H H H H H H H H H H H H H H H H H H H H H H
charge: 0
multiplicity: 1
keywords: wb97x-d3
keywords: def2-TZVPP
keywords: def2/J RIJCOSX
keywords: DEFGRID2
keywords: scfconv7
keywords: smallprint printgap noloewdin
keywords: NOSOSCF
formula: C21H25N
InChI: InChI=1/C21H25N/c1-21(2,3)15-8-5-9-16-22(4)17-19-13-10-12-18-11-6-7-14-20(18)19/h5-7,9-14H,16-17H2,1-4H3
47 atoms
N  -1.044098 -0.198158 -0.519159
C  -0.601756 1.135077 -0.129382
C  -1.574165 1.819123 0.794433
C  -2.81929 2.330723 0.322372
C  -3.714132 2.937977 1.246077
C  5.448269 -3.526625 -0.467811
C  -0.261175 -0.731452 -1.628283
C  -1.2650 1.945326 2.124969
C  -3.203757 2.276219 -1.040068
C  -1.068019 -1.110722 0.606957
C  -3.354219 3.029599 2.611091
C  -2.150442 2.548343 3.040231
C  -4.951279 3.448258 0.786256
C  6.451285 -2.905681 -1.446266
C  5.494029 -5.054432 -0.579879
C  5.793088 -3.102551 0.963963
C  1.16447 -1.068335 -1.305792
C  -4.40419 2.785907 -1.457123
C  -5.293376 3.373257 -0.535182
C  4.09663 -3.065085 -0.798614
C  1.643318 -2.314177 -1.373544
C  2.979177 -2.689471 -1.061936
H  -0.470748 1.727105 -1.038683
H  0.379392 1.116147 0.367438
H  -0.761783 -1.62813 -2.003437
H  -0.287858 0.004503 -2.437595
H  -0.316698 1.563461 2.484577
H  -2.54054 1.830136 -1.768299
H  -1.821548 -0.802427 1.331542
H  -0.109701 -1.190389 1.138473
H  -1.339633 -2.109911 0.264101
H  -4.045672 3.490498 3.306098
H  -1.870762 2.622623 4.082943
H  -5.624078 3.903909 1.502889
H  6.443398 -1.816873 -1.38508
H  6.230589 -3.190233 -2.47562
H  7.460021 -3.249536 -1.210521
H  4.788794 -5.524171 0.10677
H  5.255751 -5.385891 -1.591231
H  6.494647 -5.414748 -0.334277
H  5.771159 -2.017722 1.072902
H  5.094895 -3.530704 1.684221
H  6.796298 -3.447034 1.221257
H  1.818712 -0.26167 -0.989227
H  -4.675186 2.73666 -2.503699
H  -6.24138 3.767827 -0.877061
H  0.984127 -3.118029 -1.692225
elementType: N C H
totalener: -870.03092678 hartree
nucrepener: 1586.29327718 hartree
electener: -2456.32420396 hartree
oneelecener: -4325.14117581 hartree
twoeener: 1868.81697185 hartree
cpcmener: -0.02280553 hartree
kineticenergy: 865.85764858 hartree
xcener: -88.992048740386 hartree
chargesum: -0.0000000
charge: -0.220984 -0.031175 0.064657 -0.085147 -0.036531 0.064967 -0.046292 -0.147712 -0.256142 -0.231124 -0.152539 -0.140865 -0.101512 -0.289777 -0.292776 -0.289607 -0.140705 -0.154932 -0.158519 -0.312980 -0.231274 0.246136 0.114468 0.109169 0.101542 0.098776 0.134052 0.147903 0.111750 0.085701 0.111656 0.144982 0.158305 0.144214 0.100383 0.100831 0.097882 0.100683 0.100721 0.097652 0.100435 0.101019 0.097722 0.134545 0.158119 0.159534 0.132788
qa: -0.2210 -0.0312 0.0647 -0.0851 -0.0365 0.0650 -0.0463 -0.1477 -0.2561 -0.2311 -0.1525 -0.1409 -0.1015 -0.2898 -0.2928 -0.2896 -0.1407 -0.1549 -0.1585 -0.3130 -0.2313 0.2461 0.1145 0.1092 0.1015 0.0988 0.1341 0.1479 0.1117 0.0857 0.1117 0.1450 0.1583 0.1442 0.1004 0.1008 0.0979 0.1007 0.1007 0.0977 0.1004 0.1010 0.0977 0.1345 0.1581 0.1595 0.1328
va: 2.7877 3.7416 3.4745 3.8748 3.8399 4.0292 3.9585 3.8909 3.9962 3.9651 3.9268 3.9068 3.8673 3.8913 3.8931 3.8911 3.7662 3.9273 3.9022 4.1094 3.9721 3.6432 0.9928 1.0070 1.0034 1.0006 1.0103 1.0130 0.9913 0.9932 0.9958 1.0046 0.9906 1.0049 1.0059 1.0057 1.0031 1.0057 1.0057 1.0031 1.0061 1.0057 1.0032 1.0123 0.9925 0.9895 1.0064
dispcorr: -0.019502329 hartree
energy: -870.050429105712
dipole: 26.20252 -25.57894 0.62358 -18.84670 18.75526 -0.09144 -1.56213 1.71544 0.15332
magnitude: 0.64863 au
magnitude: 1.64869 debye
